{"text_format":"1","workbook":"xlsx","n_sheets":15,"sheets":["Important Info","Summary","Extended School Year","August","September","October","November","December","January","February","March","April","May","June","Calendar"],"not_rendered":{"charts":0,"images":3,"macros":1,"external_links":1,"defined_names":19,"comments":0,"pivot_tables":0},"unopened":[],"bounds":{"document_bytes":16777216,"sheet_cells":100000,"rows_first":2000,"rows_last":500,"rows_between":2000,"halvings":0,"cell_chars":16384,"cell_head_chars":4096},"cells_cut":0,"cells_raw":0,"read":"whole","date_system":"1900"}

{"sheet":"Important Info","index":0,"n_rows":119,"n_cols":21,"rows_kept":119,"cut":false,"hidden":false,"merged":[[113,1,119,3],[117,20,117,23],[118,20,118,23],[1,1,1,23],[8,2,8,23],[10,2,10,23],[18,2,18,23],[13,1,13,23],[7,2,7,23],[3,1,3,23],[5,1,5,23],[11,2,11,23],[17,2,17,23],[19,2,19,23],[21,1,21,17]]}
[]
[null,"INSTRUCTIONS FOR PERSONNEL ACTIVITY REPORT"]
[]
[null,"This form should be completed by any staff member who is providing services to both regular education and special education students. KSDE reimbursement will be based on pro-rated FTE for these staff members."]
[]
[null,"Exception - Early childhood special education classrooms with peer models.  FTE for these staff members should be calculated using the Early Childhood FTE calculator available on the KSDE Fiscal Auditing website."]
[]
[null,1,"Begin by selecting the appropriate school year on the Summary worksheet.  This will change the dates on the rest of the worksheets to the appropriate time period."]
[null,2,"Complete employee information on Summary worksheet.  This information will autofill to the rest of the worksheets."]
[null,3,"Choose the tab for the time period you are documenting.  "]
[null,5,"Enter ALL time worked (special ed time, regular ed time, and any other time) in minutes for each month worked."]
[null,7,"After all time is entered, the Summary worksheet will automatically calculate the staff member's sped time/FTE percentage."]
[]
[null,"IMPORTANT INFORMATION"]
[]
[null,"•","Orange highlighted cells indicate an area where the user should input data."]
[null,"•","Blue highlighted cells indicate an area where the spreadsheet contains formulas and access is restricted."]
[null,"•","Enter ALL time worked (special ed time, regular ed time, and any other time).  Worksheet must reflect all time worked because FTE reimbursed is pro-rated based on the percentage of special ed time to total time."]
[null,"•","Enter all time in minutes only.  Don't enter time in hour increments.  Worksheets won't calculate correctly if hour increments are entered.  For example, 45 minutes should be entered as \"45\" and not as \".75\"."]
[null,"•","Cutting data will cause formula errors in protected cells so we have disabled the cut function in the worksheet. Instead, copy and paste, then go back to original cell and delete data."]
[]
[null,"EXAMPLE - PERSONNEL ACTIVITY REPORT"]
[]
[null,"AUGUST WORKSHEET",null,null,null,null,null,null,null,null,null,null,null,null,"SUMMARY WORKSHEET"]
[]
[]
[]
[]
[]
[]
[]
[]
[]
[]
[]
[]
[]
[]
[]
[]
[]
[]
[]
[]
[]
[]
[]
[]
[]
[]
[]
[]
[]
[]
[]
[]
[]
[]
[]
[]
[]
[]
[]
[]
[]
[]
[]
[]
[]
[]
[]
[]
[]
[]
[]
[]
[]
[]
[]
[]
[]
[]
[]
[]
[]
[]
[]
[]
[]
[]
[]
[]
[]
[]
[]
[]
[]
[]
[]
[]
[]
[]
[]
[]
[]
[]
[]
[]
[]
[]
[]
[]
[]
[]
[]
[null,null,null,null,"Kansas State Department of Education"]
[null,null,null,null,"Fiscal Auditing"]
[null,null,null,null,"785-296-4976",null,null,null,null,null,null,null,null,null,null,null,null,null,null,null,"ESL Contact Minutes Calculator"]
[null,null,null,null,"https://www.ksde.org/Agency/Fiscal-and-Administrative-Services/Fiscal-Auditing",null,null,null,null,null,null,null,null,null,null,null,null,null,null,null,"Updated 6/18/18"]

{"sheet":"Summary","index":1,"n_rows":50,"n_cols":11,"rows_kept":50,"cut":false,"hidden":false,"merged":[[9,2,9,3],[7,4,7,8],[8,4,8,8],[9,4,9,8],[49,0,50,10],[1,1,1,9],[4,1,4,9],[13,1,13,3],[13,7,13,9],[7,2,7,3],[35,1,35,9],[36,1,36,9],[37,1,37,9],[38,1,38,9],[2,1,2,9],[10,3,10,7],[32,2,32,9],[33,1,33,9],[34,1,34,9],[8,2,8,3]]}
[]
[null,"Personnel Activity Report"]
[null,"(Time & Effort/PAR)"]
[]
[null,3]
[]
[]
[null,null,"Employee:"]
[null,null,"Employee ID #:"]
[null,null,"Employee Location:"]
[null,null,null,{"$f":"IF(AND(E8<>\"\",E9<>\"\"),\"\",\"Please complete employee information\")","v":"Please complete employee information"}]
[]
[]
[null,"Regular School Year Summary",null,null,null,null,null,"ESY Summary (Summer)"]
[null,"Month","Sped Hours","Total Hours",null,null,null,"Month","Sped Hours","Total Hours"]
[null,"August",{"$f":"IF(COUNTA(INDIRECT(\"'\"&$B16&\"'!$E$10:$H$40\"))>0,INDIRECT(\"'\"&$B16&\"'!$E$41\"),\"\")","v":0},{"$f":"IF(COUNTA(INDIRECT(\"'\"&$B16&\"'!$E$10:$H$40\"))>0,INDIRECT(\"'\"&$B16&\"'!$i$41\"),\"\")","v":0},null,null,null,"May (ESY)",{"$f":"IF(COUNTA('Extended School Year'!E9:H39)>0,'Extended School Year'!E41,0)","v":0},{"$f":"IF(COUNTA('Extended School Year'!F9:I39)>0,'Extended School Year'!I41,0)","v":0}]
[null,"September",0,0,null,null,null,"June (ESY)",{"$f":"IF(COUNTA('Extended School Year'!E10:H40)>0,'Extended School Year'!E82,0)","v":0},{"$f":"IF(COUNTA('Extended School Year'!F10:I40)>0,'Extended School Year'!I82,0)","v":0}]
[null,"October",0,0,null,null,null,"July (ESY)",{"$f":"IF(COUNTA('Extended School Year'!E11:H41)>0,'Extended School Year'!E123,0)","v":0},{"$f":"IF(COUNTA('Extended School Year'!F11:I41)>0,'Extended School Year'!I123,0)","v":0}]
[null,"November",0,0,null,null,null,"August (ESY)",{"$f":"IF(COUNTA('Extended School Year'!E12:H42)>0,'Extended School Year'!E164,0)","v":0},{"$f":"IF(COUNTA('Extended School Year'!F12:I42)>0,'Extended School Year'!I164,0)","v":0}]
[null,"December",0,0]
[null,"January",0,0,null,null,null,"ESY Total",{"$f":"SUM(I16:I19)","v":0},{"$f":"SUM(J16:J19)","v":0}]
[null,"February",0,0,null,null,null,"# of Months",{"$f":"COUNTIF(I16:I19,\"<>0\")","v":0}]
[null,"March",0,0,null,null,null,"Sped/FTE percentage",{"$f":"IF(I22=0,0,MIN(1,ROUND(I21/J21,5)))","v":0}]
[null,"April",0,0,null,null,null,"Allowable hours",{"$f":"MIN(335,I21)","v":0}]
[null,"May",0,0]
[null,"June",0,0]
[null,"Reg School Yr Total",{"$f":"SUM(C16:C26)","v":0},{"$f":"SUM(D16:D26)","v":0}]
[null,"# of Months",{"$f":"COUNTIF(C16:C26,\"<>0\")","v":0}]
[null,"Sped/FTE percentage",{"$f":"IF(C28=0,0,MIN(1,ROUND(C27/D27,5)))","v":0}]
[null,"Allowable Hours",{"$f":"MIN(1116,C27)","v":0}]
[]
[]
[null,"Notes"]
[]
[]
[]
[]
[]
[]
[]
[]
[]
[]
[null,null,"Kansas State Department of Education",null,null,null,null,null,null,null,"Personnel Activity Report"]
[null,null,"Fiscal Auditing",null,null,null,null,null,null,null,"Updated 9/20/18"]
[null,null,"785-296-4976"]
[null,null,"https://www.ksde.org/Agency/Fiscal-and-Administrative-Services/Fiscal-Auditing"]
[]
[]
["The Kansas State Department of Education does not discriminate on the basis of race, color, national origin, sex, disability, or age in its programs and activities and provides equal access to the Boy Scouts and other designated youth groups. The following person has been designated to handle inquiries regarding the nondiscrimination policies: KSDE General Counsel, Office of General Counsel, KSDE, Landon State Office Building, 900 S.W. Jackson, Suite 102, Topeka, KS 66612, (785) 296-3204."]

{"sheet":"Extended School Year","index":2,"n_rows":183,"n_cols":12,"rows_kept":183,"cut":false,"hidden":false,"merged":[[166,3,166,8],[167,2,167,8],[168,2,168,8],[169,2,169,8],[170,2,170,8],[88,2,88,8],[85,2,85,8],[125,2,125,8],[126,2,126,8],[127,2,127,8],[123,2,123,8],[124,2,124,8],[182,2,183,8],[45,2,45,8],[86,2,86,8],[44,2,44,8],[2,2,2,8],[46,2,46,8],[3,2,3,8],[5,2,5,8],[6,2,6,8],[43,2,43,8],[4,2,4,8],[47,2,47,8],[84,2,84,8],[128,2,128,8],[129,2,129,8],[87,2,87,8]]}
[]
[]
[null,null,"Personnel Activity Report"]
[null,null,"Extended School Year"]
[null,null,"May"]
[null,null,{"$f":"IF(Summary!$E$8<>\"\",Summary!$E$8,\" \")","v":" "}]
[null,null,{"$f":"IF(Summary!$E$9<>\"\",Summary!$E$9,\" \")","v":" "}]
[null,null,"Day","Date","Special Ed","General Ed","Other","Other","Totals",null,null,{"$f":"IF(OR(AND(F8=\"\",COUNTA(F9:F39)>0),AND(G8=\"\",COUNTA(G9:G39)>0),AND(H8=\"\",COUNTA(H9:H39)>0)),\"<<< You must identify the cost objective in the column heading.\",\"\")","v":""}]
[501,null,{"$f":"IF(ISNA(IF(Summary!$B$5=3,IF(VLOOKUP(A9,Calendar!$A$3:$G$459,7,FALSE)=\"S\", \"\", VLOOKUP(A9,Calendar!$A$3:$G$459,7,FALSE)),IF(VLOOKUP(A9,Calendar!$A$3:$G$459,4,FALSE)=\"S\", \"\", VLOOKUP(A9,Calendar!$A$3:$G$459,4,FALSE)))),\"\",IF(Summary!$B$5=3,IF(VLOOKUP(A9,Calendar!$A$3:$G$459,7,FALSE)=\"S\", \"\", VLOOKUP(A9,Calendar!$A$3:$G$459,7,FALSE)),IF(VLOOKUP(A9,Calendar!$A$3:$G$459,4,FALSE)=\"S\", \"\", VLOOKUP(A9,Calendar!$A$3:$G$459,4,FALSE))))","v":"W"},{"$f":"IF(Summary!$B$5=3,IF(C9=\"\",\"\",VLOOKUP(A9,Calendar!$A$3:$G$459,5,FALSE)),IF(C9=\"\",\"\",VLOOKUP(A9,Calendar!$A$3:$G$459,2,FALSE)))","v":"2019-05-01"},null,null,null,null,{"$f":"MIN(1440,SUM(E9:H9))","v":0},null,null,{"$f":"IF(I9>390, \"<<< Day exceeds 390 minutes. Confirm reported time.\",\"\")","v":""}]
[502,null,{"$f":"IF(ISNA(IF(Summary!$B$5=3,IF(VLOOKUP(A10,Calendar!$A$3:$G$459,7,FALSE)=\"S\", \"\", VLOOKUP(A10,Calendar!$A$3:$G$459,7,FALSE)),IF(VLOOKUP(A10,Calendar!$A$3:$G$459,4,FALSE)=\"S\", \"\", VLOOKUP(A10,Calendar!$A$3:$G$459,4,FALSE)))),\"\",IF(Summary!$B$5=3,IF(VLOOKUP(A10,Calendar!$A$3:$G$459,7,FALSE)=\"S\", \"\", VLOOKUP(A10,Calendar!$A$3:$G$459,7,FALSE)),IF(VLOOKUP(A10,Calendar!$A$3:$G$459,4,FALSE)=\"S\", \"\", VLOOKUP(A10,Calendar!$A$3:$G$459,4,FALSE))))","v":"R"},{"$f":"IF(Summary!$B$5=3,IF(C10=\"\",\"\",VLOOKUP(A10,Calendar!$A$3:$G$459,5,FALSE)),IF(C10=\"\",\"\",VLOOKUP(A10,Calendar!$A$3:$G$459,2,FALSE)))","v":"2019-05-02"},null,null,null,null,{"$f":"MIN(1440,SUM(E10:H10))","v":0},null,null,{"$f":"IF(I10>390, \"<<< Day exceeds 390 minutes. Confirm reported time.\",\"\")","v":""}]
[503,null,{"$f":"IF(ISNA(IF(Summary!$B$5=3,IF(VLOOKUP(A11,Calendar!$A$3:$G$459,7,FALSE)=\"S\", \"\", VLOOKUP(A11,Calendar!$A$3:$G$459,7,FALSE)),IF(VLOOKUP(A11,Calendar!$A$3:$G$459,4,FALSE)=\"S\", \"\", VLOOKUP(A11,Calendar!$A$3:$G$459,4,FALSE)))),\"\",IF(Summary!$B$5=3,IF(VLOOKUP(A11,Calendar!$A$3:$G$459,7,FALSE)=\"S\", \"\", VLOOKUP(A11,Calendar!$A$3:$G$459,7,FALSE)),IF(VLOOKUP(A11,Calendar!$A$3:$G$459,4,FALSE)=\"S\", \"\", VLOOKUP(A11,Calendar!$A$3:$G$459,4,FALSE))))","v":"F"},{"$f":"IF(Summary!$B$5=3,IF(C11=\"\",\"\",VLOOKUP(A11,Calendar!$A$3:$G$459,5,FALSE)),IF(C11=\"\",\"\",VLOOKUP(A11,Calendar!$A$3:$G$459,2,FALSE)))","v":"2019-05-03"},null,null,null,null,0,null,null,""]
[504,null,{"$f":"IF(ISNA(IF(Summary!$B$5=3,IF(VLOOKUP(A12,Calendar!$A$3:$G$459,7,FALSE)=\"S\", \"\", VLOOKUP(A12,Calendar!$A$3:$G$459,7,FALSE)),IF(VLOOKUP(A12,Calendar!$A$3:$G$459,4,FALSE)=\"S\", \"\", VLOOKUP(A12,Calendar!$A$3:$G$459,4,FALSE)))),\"\",IF(Summary!$B$5=3,IF(VLOOKUP(A12,Calendar!$A$3:$G$459,7,FALSE)=\"S\", \"\", VLOOKUP(A12,Calendar!$A$3:$G$459,7,FALSE)),IF(VLOOKUP(A12,Calendar!$A$3:$G$459,4,FALSE)=\"S\", \"\", VLOOKUP(A12,Calendar!$A$3:$G$459,4,FALSE))))","v":""},{"$f":"IF(Summary!$B$5=3,IF(C12=\"\",\"\",VLOOKUP(A12,Calendar!$A$3:$G$459,5,FALSE)),IF(C12=\"\",\"\",VLOOKUP(A12,Calendar!$A$3:$G$459,2,FALSE)))","v":""},null,null,null,null,0,null,null,""]
[505,null,{"$f":"IF(ISNA(IF(Summary!$B$5=3,IF(VLOOKUP(A13,Calendar!$A$3:$G$459,7,FALSE)=\"S\", \"\", VLOOKUP(A13,Calendar!$A$3:$G$459,7,FALSE)),IF(VLOOKUP(A13,Calendar!$A$3:$G$459,4,FALSE)=\"S\", \"\", VLOOKUP(A13,Calendar!$A$3:$G$459,4,FALSE)))),\"\",IF(Summary!$B$5=3,IF(VLOOKUP(A13,Calendar!$A$3:$G$459,7,FALSE)=\"S\", \"\", VLOOKUP(A13,Calendar!$A$3:$G$459,7,FALSE)),IF(VLOOKUP(A13,Calendar!$A$3:$G$459,4,FALSE)=\"S\", \"\", VLOOKUP(A13,Calendar!$A$3:$G$459,4,FALSE))))","v":""},{"$f":"IF(Summary!$B$5=3,IF(C13=\"\",\"\",VLOOKUP(A13,Calendar!$A$3:$G$459,5,FALSE)),IF(C13=\"\",\"\",VLOOKUP(A13,Calendar!$A$3:$G$459,2,FALSE)))","v":""},null,null,null,null,0,null,null,""]
[506,null,{"$f":"IF(ISNA(IF(Summary!$B$5=3,IF(VLOOKUP(A14,Calendar!$A$3:$G$459,7,FALSE)=\"S\", \"\", VLOOKUP(A14,Calendar!$A$3:$G$459,7,FALSE)),IF(VLOOKUP(A14,Calendar!$A$3:$G$459,4,FALSE)=\"S\", \"\", VLOOKUP(A14,Calendar!$A$3:$G$459,4,FALSE)))),\"\",IF(Summary!$B$5=3,IF(VLOOKUP(A14,Calendar!$A$3:$G$459,7,FALSE)=\"S\", \"\", VLOOKUP(A14,Calendar!$A$3:$G$459,7,FALSE)),IF(VLOOKUP(A14,Calendar!$A$3:$G$459,4,FALSE)=\"S\", \"\", VLOOKUP(A14,Calendar!$A$3:$G$459,4,FALSE))))","v":"M"},{"$f":"IF(Summary!$B$5=3,IF(C14=\"\",\"\",VLOOKUP(A14,Calendar!$A$3:$G$459,5,FALSE)),IF(C14=\"\",\"\",VLOOKUP(A14,Calendar!$A$3:$G$459,2,FALSE)))","v":"2019-05-06"},null,null,null,null,0,null,null,""]
[507,null,{"$f":"IF(ISNA(IF(Summary!$B$5=3,IF(VLOOKUP(A15,Calendar!$A$3:$G$459,7,FALSE)=\"S\", \"\", VLOOKUP(A15,Calendar!$A$3:$G$459,7,FALSE)),IF(VLOOKUP(A15,Calendar!$A$3:$G$459,4,FALSE)=\"S\", \"\", VLOOKUP(A15,Calendar!$A$3:$G$459,4,FALSE)))),\"\",IF(Summary!$B$5=3,IF(VLOOKUP(A15,Calendar!$A$3:$G$459,7,FALSE)=\"S\", \"\", VLOOKUP(A15,Calendar!$A$3:$G$459,7,FALSE)),IF(VLOOKUP(A15,Calendar!$A$3:$G$459,4,FALSE)=\"S\", \"\", VLOOKUP(A15,Calendar!$A$3:$G$459,4,FALSE))))","v":"T"},{"$f":"IF(Summary!$B$5=3,IF(C15=\"\",\"\",VLOOKUP(A15,Calendar!$A$3:$G$459,5,FALSE)),IF(C15=\"\",\"\",VLOOKUP(A15,Calendar!$A$3:$G$459,2,FALSE)))","v":"2019-05-07"},null,null,null,null,0,null,null,""]
[508,null,{"$f":"IF(ISNA(IF(Summary!$B$5=3,IF(VLOOKUP(A16,Calendar!$A$3:$G$459,7,FALSE)=\"S\", \"\", VLOOKUP(A16,Calendar!$A$3:$G$459,7,FALSE)),IF(VLOOKUP(A16,Calendar!$A$3:$G$459,4,FALSE)=\"S\", \"\", VLOOKUP(A16,Calendar!$A$3:$G$459,4,FALSE)))),\"\",IF(Summary!$B$5=3,IF(VLOOKUP(A16,Calendar!$A$3:$G$459,7,FALSE)=\"S\", \"\", VLOOKUP(A16,Calendar!$A$3:$G$459,7,FALSE)),IF(VLOOKUP(A16,Calendar!$A$3:$G$459,4,FALSE)=\"S\", \"\", VLOOKUP(A16,Calendar!$A$3:$G$459,4,FALSE))))","v":"W"},{"$f":"IF(Summary!$B$5=3,IF(C16=\"\",\"\",VLOOKUP(A16,Calendar!$A$3:$G$459,5,FALSE)),IF(C16=\"\",\"\",VLOOKUP(A16,Calendar!$A$3:$G$459,2,FALSE)))","v":"2019-05-08"},null,null,null,null,0,null,null,""]
[509,null,{"$f":"IF(ISNA(IF(Summary!$B$5=3,IF(VLOOKUP(A17,Calendar!$A$3:$G$459,7,FALSE)=\"S\", \"\", VLOOKUP(A17,Calendar!$A$3:$G$459,7,FALSE)),IF(VLOOKUP(A17,Calendar!$A$3:$G$459,4,FALSE)=\"S\", \"\", VLOOKUP(A17,Calendar!$A$3:$G$459,4,FALSE)))),\"\",IF(Summary!$B$5=3,IF(VLOOKUP(A17,Calendar!$A$3:$G$459,7,FALSE)=\"S\", \"\", VLOOKUP(A17,Calendar!$A$3:$G$459,7,FALSE)),IF(VLOOKUP(A17,Calendar!$A$3:$G$459,4,FALSE)=\"S\", \"\", VLOOKUP(A17,Calendar!$A$3:$G$459,4,FALSE))))","v":"R"},{"$f":"IF(Summary!$B$5=3,IF(C17=\"\",\"\",VLOOKUP(A17,Calendar!$A$3:$G$459,5,FALSE)),IF(C17=\"\",\"\",VLOOKUP(A17,Calendar!$A$3:$G$459,2,FALSE)))","v":"2019-05-09"},null,null,null,null,0,null,null,""]
[510,null,{"$f":"IF(ISNA(IF(Summary!$B$5=3,IF(VLOOKUP(A18,Calendar!$A$3:$G$459,7,FALSE)=\"S\", \"\", VLOOKUP(A18,Calendar!$A$3:$G$459,7,FALSE)),IF(VLOOKUP(A18,Calendar!$A$3:$G$459,4,FALSE)=\"S\", \"\", VLOOKUP(A18,Calendar!$A$3:$G$459,4,FALSE)))),\"\",IF(Summary!$B$5=3,IF(VLOOKUP(A18,Calendar!$A$3:$G$459,7,FALSE)=\"S\", \"\", VLOOKUP(A18,Calendar!$A$3:$G$459,7,FALSE)),IF(VLOOKUP(A18,Calendar!$A$3:$G$459,4,FALSE)=\"S\", \"\", VLOOKUP(A18,Calendar!$A$3:$G$459,4,FALSE))))","v":"F"},{"$f":"IF(Summary!$B$5=3,IF(C18=\"\",\"\",VLOOKUP(A18,Calendar!$A$3:$G$459,5,FALSE)),IF(C18=\"\",\"\",VLOOKUP(A18,Calendar!$A$3:$G$459,2,FALSE)))","v":"2019-05-10"},null,null,null,null,0,null,null,""]
[511,null,{"$f":"IF(ISNA(IF(Summary!$B$5=3,IF(VLOOKUP(A19,Calendar!$A$3:$G$459,7,FALSE)=\"S\", \"\", VLOOKUP(A19,Calendar!$A$3:$G$459,7,FALSE)),IF(VLOOKUP(A19,Calendar!$A$3:$G$459,4,FALSE)=\"S\", \"\", VLOOKUP(A19,Calendar!$A$3:$G$459,4,FALSE)))),\"\",IF(Summary!$B$5=3,IF(VLOOKUP(A19,Calendar!$A$3:$G$459,7,FALSE)=\"S\", \"\", VLOOKUP(A19,Calendar!$A$3:$G$459,7,FALSE)),IF(VLOOKUP(A19,Calendar!$A$3:$G$459,4,FALSE)=\"S\", \"\", VLOOKUP(A19,Calendar!$A$3:$G$459,4,FALSE))))","v":""},{"$f":"IF(Summary!$B$5=3,IF(C19=\"\",\"\",VLOOKUP(A19,Calendar!$A$3:$G$459,5,FALSE)),IF(C19=\"\",\"\",VLOOKUP(A19,Calendar!$A$3:$G$459,2,FALSE)))","v":""},null,null,null,null,0,null,null,""]
[512,null,{"$f":"IF(ISNA(IF(Summary!$B$5=3,IF(VLOOKUP(A20,Calendar!$A$3:$G$459,7,FALSE)=\"S\", \"\", VLOOKUP(A20,Calendar!$A$3:$G$459,7,FALSE)),IF(VLOOKUP(A20,Calendar!$A$3:$G$459,4,FALSE)=\"S\", \"\", VLOOKUP(A20,Calendar!$A$3:$G$459,4,FALSE)))),\"\",IF(Summary!$B$5=3,IF(VLOOKUP(A20,Calendar!$A$3:$G$459,7,FALSE)=\"S\", \"\", VLOOKUP(A20,Calendar!$A$3:$G$459,7,FALSE)),IF(VLOOKUP(A20,Calendar!$A$3:$G$459,4,FALSE)=\"S\", \"\", VLOOKUP(A20,Calendar!$A$3:$G$459,4,FALSE))))","v":""},{"$f":"IF(Summary!$B$5=3,IF(C20=\"\",\"\",VLOOKUP(A20,Calendar!$A$3:$G$459,5,FALSE)),IF(C20=\"\",\"\",VLOOKUP(A20,Calendar!$A$3:$G$459,2,FALSE)))","v":""},null,null,null,null,0,null,null,""]
[513,null,{"$f":"IF(ISNA(IF(Summary!$B$5=3,IF(VLOOKUP(A21,Calendar!$A$3:$G$459,7,FALSE)=\"S\", \"\", VLOOKUP(A21,Calendar!$A$3:$G$459,7,FALSE)),IF(VLOOKUP(A21,Calendar!$A$3:$G$459,4,FALSE)=\"S\", \"\", VLOOKUP(A21,Calendar!$A$3:$G$459,4,FALSE)))),\"\",IF(Summary!$B$5=3,IF(VLOOKUP(A21,Calendar!$A$3:$G$459,7,FALSE)=\"S\", \"\", VLOOKUP(A21,Calendar!$A$3:$G$459,7,FALSE)),IF(VLOOKUP(A21,Calendar!$A$3:$G$459,4,FALSE)=\"S\", \"\", VLOOKUP(A21,Calendar!$A$3:$G$459,4,FALSE))))","v":"M"},{"$f":"IF(Summary!$B$5=3,IF(C21=\"\",\"\",VLOOKUP(A21,Calendar!$A$3:$G$459,5,FALSE)),IF(C21=\"\",\"\",VLOOKUP(A21,Calendar!$A$3:$G$459,2,FALSE)))","v":"2019-05-13"},null,null,null,null,0,null,null,""]
[514,null,{"$f":"IF(ISNA(IF(Summary!$B$5=3,IF(VLOOKUP(A22,Calendar!$A$3:$G$459,7,FALSE)=\"S\", \"\", VLOOKUP(A22,Calendar!$A$3:$G$459,7,FALSE)),IF(VLOOKUP(A22,Calendar!$A$3:$G$459,4,FALSE)=\"S\", \"\", VLOOKUP(A22,Calendar!$A$3:$G$459,4,FALSE)))),\"\",IF(Summary!$B$5=3,IF(VLOOKUP(A22,Calendar!$A$3:$G$459,7,FALSE)=\"S\", \"\", VLOOKUP(A22,Calendar!$A$3:$G$459,7,FALSE)),IF(VLOOKUP(A22,Calendar!$A$3:$G$459,4,FALSE)=\"S\", \"\", VLOOKUP(A22,Calendar!$A$3:$G$459,4,FALSE))))","v":"T"},{"$f":"IF(Summary!$B$5=3,IF(C22=\"\",\"\",VLOOKUP(A22,Calendar!$A$3:$G$459,5,FALSE)),IF(C22=\"\",\"\",VLOOKUP(A22,Calendar!$A$3:$G$459,2,FALSE)))","v":"2019-05-14"},null,null,null,null,0,null,null,""]
[515,null,{"$f":"IF(ISNA(IF(Summary!$B$5=3,IF(VLOOKUP(A23,Calendar!$A$3:$G$459,7,FALSE)=\"S\", \"\", VLOOKUP(A23,Calendar!$A$3:$G$459,7,FALSE)),IF(VLOOKUP(A23,Calendar!$A$3:$G$459,4,FALSE)=\"S\", \"\", VLOOKUP(A23,Calendar!$A$3:$G$459,4,FALSE)))),\"\",IF(Summary!$B$5=3,IF(VLOOKUP(A23,Calendar!$A$3:$G$459,7,FALSE)=\"S\", \"\", VLOOKUP(A23,Calendar!$A$3:$G$459,7,FALSE)),IF(VLOOKUP(A23,Calendar!$A$3:$G$459,4,FALSE)=\"S\", \"\", VLOOKUP(A23,Calendar!$A$3:$G$459,4,FALSE))))","v":"W"},{"$f":"IF(Summary!$B$5=3,IF(C23=\"\",\"\",VLOOKUP(A23,Calendar!$A$3:$G$459,5,FALSE)),IF(C23=\"\",\"\",VLOOKUP(A23,Calendar!$A$3:$G$459,2,FALSE)))","v":"2019-05-15"},null,null,null,null,0,null,null,""]
[516,null,{"$f":"IF(ISNA(IF(Summary!$B$5=3,IF(VLOOKUP(A24,Calendar!$A$3:$G$459,7,FALSE)=\"S\", \"\", VLOOKUP(A24,Calendar!$A$3:$G$459,7,FALSE)),IF(VLOOKUP(A24,Calendar!$A$3:$G$459,4,FALSE)=\"S\", \"\", VLOOKUP(A24,Calendar!$A$3:$G$459,4,FALSE)))),\"\",IF(Summary!$B$5=3,IF(VLOOKUP(A24,Calendar!$A$3:$G$459,7,FALSE)=\"S\", \"\", VLOOKUP(A24,Calendar!$A$3:$G$459,7,FALSE)),IF(VLOOKUP(A24,Calendar!$A$3:$G$459,4,FALSE)=\"S\", \"\", VLOOKUP(A24,Calendar!$A$3:$G$459,4,FALSE))))","v":"R"},{"$f":"IF(Summary!$B$5=3,IF(C24=\"\",\"\",VLOOKUP(A24,Calendar!$A$3:$G$459,5,FALSE)),IF(C24=\"\",\"\",VLOOKUP(A24,Calendar!$A$3:$G$459,2,FALSE)))","v":"2019-05-16"},null,null,null,null,0,null,null,""]
[517,null,{"$f":"IF(ISNA(IF(Summary!$B$5=3,IF(VLOOKUP(A25,Calendar!$A$3:$G$459,7,FALSE)=\"S\", \"\", VLOOKUP(A25,Calendar!$A$3:$G$459,7,FALSE)),IF(VLOOKUP(A25,Calendar!$A$3:$G$459,4,FALSE)=\"S\", \"\", VLOOKUP(A25,Calendar!$A$3:$G$459,4,FALSE)))),\"\",IF(Summary!$B$5=3,IF(VLOOKUP(A25,Calendar!$A$3:$G$459,7,FALSE)=\"S\", \"\", VLOOKUP(A25,Calendar!$A$3:$G$459,7,FALSE)),IF(VLOOKUP(A25,Calendar!$A$3:$G$459,4,FALSE)=\"S\", \"\", VLOOKUP(A25,Calendar!$A$3:$G$459,4,FALSE))))","v":"F"},{"$f":"IF(Summary!$B$5=3,IF(C25=\"\",\"\",VLOOKUP(A25,Calendar!$A$3:$G$459,5,FALSE)),IF(C25=\"\",\"\",VLOOKUP(A25,Calendar!$A$3:$G$459,2,FALSE)))","v":"2019-05-17"},null,null,null,null,0,null,null,""]
[518,null,{"$f":"IF(ISNA(IF(Summary!$B$5=3,IF(VLOOKUP(A26,Calendar!$A$3:$G$459,7,FALSE)=\"S\", \"\", VLOOKUP(A26,Calendar!$A$3:$G$459,7,FALSE)),IF(VLOOKUP(A26,Calendar!$A$3:$G$459,4,FALSE)=\"S\", \"\", VLOOKUP(A26,Calendar!$A$3:$G$459,4,FALSE)))),\"\",IF(Summary!$B$5=3,IF(VLOOKUP(A26,Calendar!$A$3:$G$459,7,FALSE)=\"S\", \"\", VLOOKUP(A26,Calendar!$A$3:$G$459,7,FALSE)),IF(VLOOKUP(A26,Calendar!$A$3:$G$459,4,FALSE)=\"S\", \"\", VLOOKUP(A26,Calendar!$A$3:$G$459,4,FALSE))))","v":""},{"$f":"IF(Summary!$B$5=3,IF(C26=\"\",\"\",VLOOKUP(A26,Calendar!$A$3:$G$459,5,FALSE)),IF(C26=\"\",\"\",VLOOKUP(A26,Calendar!$A$3:$G$459,2,FALSE)))","v":""},null,null,null,null,0,null,null,""]
[519,null,{"$f":"IF(ISNA(IF(Summary!$B$5=3,IF(VLOOKUP(A27,Calendar!$A$3:$G$459,7,FALSE)=\"S\", \"\", VLOOKUP(A27,Calendar!$A$3:$G$459,7,FALSE)),IF(VLOOKUP(A27,Calendar!$A$3:$G$459,4,FALSE)=\"S\", \"\", VLOOKUP(A27,Calendar!$A$3:$G$459,4,FALSE)))),\"\",IF(Summary!$B$5=3,IF(VLOOKUP(A27,Calendar!$A$3:$G$459,7,FALSE)=\"S\", \"\", VLOOKUP(A27,Calendar!$A$3:$G$459,7,FALSE)),IF(VLOOKUP(A27,Calendar!$A$3:$G$459,4,FALSE)=\"S\", \"\", VLOOKUP(A27,Calendar!$A$3:$G$459,4,FALSE))))","v":""},{"$f":"IF(Summary!$B$5=3,IF(C27=\"\",\"\",VLOOKUP(A27,Calendar!$A$3:$G$459,5,FALSE)),IF(C27=\"\",\"\",VLOOKUP(A27,Calendar!$A$3:$G$459,2,FALSE)))","v":""},null,null,null,null,0,null,null,""]
[520,null,{"$f":"IF(ISNA(IF(Summary!$B$5=3,IF(VLOOKUP(A28,Calendar!$A$3:$G$459,7,FALSE)=\"S\", \"\", VLOOKUP(A28,Calendar!$A$3:$G$459,7,FALSE)),IF(VLOOKUP(A28,Calendar!$A$3:$G$459,4,FALSE)=\"S\", \"\", VLOOKUP(A28,Calendar!$A$3:$G$459,4,FALSE)))),\"\",IF(Summary!$B$5=3,IF(VLOOKUP(A28,Calendar!$A$3:$G$459,7,FALSE)=\"S\", \"\", VLOOKUP(A28,Calendar!$A$3:$G$459,7,FALSE)),IF(VLOOKUP(A28,Calendar!$A$3:$G$459,4,FALSE)=\"S\", \"\", VLOOKUP(A28,Calendar!$A$3:$G$459,4,FALSE))))","v":"M"},{"$f":"IF(Summary!$B$5=3,IF(C28=\"\",\"\",VLOOKUP(A28,Calendar!$A$3:$G$459,5,FALSE)),IF(C28=\"\",\"\",VLOOKUP(A28,Calendar!$A$3:$G$459,2,FALSE)))","v":"2019-05-20"},null,null,null,null,0,null,null,""]
[521,null,{"$f":"IF(ISNA(IF(Summary!$B$5=3,IF(VLOOKUP(A29,Calendar!$A$3:$G$459,7,FALSE)=\"S\", \"\", VLOOKUP(A29,Calendar!$A$3:$G$459,7,FALSE)),IF(VLOOKUP(A29,Calendar!$A$3:$G$459,4,FALSE)=\"S\", \"\", VLOOKUP(A29,Calendar!$A$3:$G$459,4,FALSE)))),\"\",IF(Summary!$B$5=3,IF(VLOOKUP(A29,Calendar!$A$3:$G$459,7,FALSE)=\"S\", \"\", VLOOKUP(A29,Calendar!$A$3:$G$459,7,FALSE)),IF(VLOOKUP(A29,Calendar!$A$3:$G$459,4,FALSE)=\"S\", \"\", VLOOKUP(A29,Calendar!$A$3:$G$459,4,FALSE))))","v":"T"},{"$f":"IF(Summary!$B$5=3,IF(C29=\"\",\"\",VLOOKUP(A29,Calendar!$A$3:$G$459,5,FALSE)),IF(C29=\"\",\"\",VLOOKUP(A29,Calendar!$A$3:$G$459,2,FALSE)))","v":"2019-05-21"},null,null,null,null,0,null,null,""]
[522,null,{"$f":"IF(ISNA(IF(Summary!$B$5=3,IF(VLOOKUP(A30,Calendar!$A$3:$G$459,7,FALSE)=\"S\", \"\", VLOOKUP(A30,Calendar!$A$3:$G$459,7,FALSE)),IF(VLOOKUP(A30,Calendar!$A$3:$G$459,4,FALSE)=\"S\", \"\", VLOOKUP(A30,Calendar!$A$3:$G$459,4,FALSE)))),\"\",IF(Summary!$B$5=3,IF(VLOOKUP(A30,Calendar!$A$3:$G$459,7,FALSE)=\"S\", \"\", VLOOKUP(A30,Calendar!$A$3:$G$459,7,FALSE)),IF(VLOOKUP(A30,Calendar!$A$3:$G$459,4,FALSE)=\"S\", \"\", VLOOKUP(A30,Calendar!$A$3:$G$459,4,FALSE))))","v":"W"},{"$f":"IF(Summary!$B$5=3,IF(C30=\"\",\"\",VLOOKUP(A30,Calendar!$A$3:$G$459,5,FALSE)),IF(C30=\"\",\"\",VLOOKUP(A30,Calendar!$A$3:$G$459,2,FALSE)))","v":"2019-05-22"},null,null,null,null,0,null,null,""]
[523,null,{"$f":"IF(ISNA(IF(Summary!$B$5=3,IF(VLOOKUP(A31,Calendar!$A$3:$G$459,7,FALSE)=\"S\", \"\", VLOOKUP(A31,Calendar!$A$3:$G$459,7,FALSE)),IF(VLOOKUP(A31,Calendar!$A$3:$G$459,4,FALSE)=\"S\", \"\", VLOOKUP(A31,Calendar!$A$3:$G$459,4,FALSE)))),\"\",IF(Summary!$B$5=3,IF(VLOOKUP(A31,Calendar!$A$3:$G$459,7,FALSE)=\"S\", \"\", VLOOKUP(A31,Calendar!$A$3:$G$459,7,FALSE)),IF(VLOOKUP(A31,Calendar!$A$3:$G$459,4,FALSE)=\"S\", \"\", VLOOKUP(A31,Calendar!$A$3:$G$459,4,FALSE))))","v":"R"},{"$f":"IF(Summary!$B$5=3,IF(C31=\"\",\"\",VLOOKUP(A31,Calendar!$A$3:$G$459,5,FALSE)),IF(C31=\"\",\"\",VLOOKUP(A31,Calendar!$A$3:$G$459,2,FALSE)))","v":"2019-05-23"},null,null,null,null,0,null,null,""]
[524,null,{"$f":"IF(ISNA(IF(Summary!$B$5=3,IF(VLOOKUP(A32,Calendar!$A$3:$G$459,7,FALSE)=\"S\", \"\", VLOOKUP(A32,Calendar!$A$3:$G$459,7,FALSE)),IF(VLOOKUP(A32,Calendar!$A$3:$G$459,4,FALSE)=\"S\", \"\", VLOOKUP(A32,Calendar!$A$3:$G$459,4,FALSE)))),\"\",IF(Summary!$B$5=3,IF(VLOOKUP(A32,Calendar!$A$3:$G$459,7,FALSE)=\"S\", \"\", VLOOKUP(A32,Calendar!$A$3:$G$459,7,FALSE)),IF(VLOOKUP(A32,Calendar!$A$3:$G$459,4,FALSE)=\"S\", \"\", VLOOKUP(A32,Calendar!$A$3:$G$459,4,FALSE))))","v":"F"},{"$f":"IF(Summary!$B$5=3,IF(C32=\"\",\"\",VLOOKUP(A32,Calendar!$A$3:$G$459,5,FALSE)),IF(C32=\"\",\"\",VLOOKUP(A32,Calendar!$A$3:$G$459,2,FALSE)))","v":"2019-05-24"},null,null,null,null,0,null,null,""]
[525,null,{"$f":"IF(ISNA(IF(Summary!$B$5=3,IF(VLOOKUP(A33,Calendar!$A$3:$G$459,7,FALSE)=\"S\", \"\", VLOOKUP(A33,Calendar!$A$3:$G$459,7,FALSE)),IF(VLOOKUP(A33,Calendar!$A$3:$G$459,4,FALSE)=\"S\", \"\", VLOOKUP(A33,Calendar!$A$3:$G$459,4,FALSE)))),\"\",IF(Summary!$B$5=3,IF(VLOOKUP(A33,Calendar!$A$3:$G$459,7,FALSE)=\"S\", \"\", VLOOKUP(A33,Calendar!$A$3:$G$459,7,FALSE)),IF(VLOOKUP(A33,Calendar!$A$3:$G$459,4,FALSE)=\"S\", \"\", VLOOKUP(A33,Calendar!$A$3:$G$459,4,FALSE))))","v":""},{"$f":"IF(Summary!$B$5=3,IF(C33=\"\",\"\",VLOOKUP(A33,Calendar!$A$3:$G$459,5,FALSE)),IF(C33=\"\",\"\",VLOOKUP(A33,Calendar!$A$3:$G$459,2,FALSE)))","v":""},null,null,null,null,0,null,null,""]
[526,null,{"$f":"IF(ISNA(IF(Summary!$B$5=3,IF(VLOOKUP(A34,Calendar!$A$3:$G$459,7,FALSE)=\"S\", \"\", VLOOKUP(A34,Calendar!$A$3:$G$459,7,FALSE)),IF(VLOOKUP(A34,Calendar!$A$3:$G$459,4,FALSE)=\"S\", \"\", VLOOKUP(A34,Calendar!$A$3:$G$459,4,FALSE)))),\"\",IF(Summary!$B$5=3,IF(VLOOKUP(A34,Calendar!$A$3:$G$459,7,FALSE)=\"S\", \"\", VLOOKUP(A34,Calendar!$A$3:$G$459,7,FALSE)),IF(VLOOKUP(A34,Calendar!$A$3:$G$459,4,FALSE)=\"S\", \"\", VLOOKUP(A34,Calendar!$A$3:$G$459,4,FALSE))))","v":""},{"$f":"IF(Summary!$B$5=3,IF(C34=\"\",\"\",VLOOKUP(A34,Calendar!$A$3:$G$459,5,FALSE)),IF(C34=\"\",\"\",VLOOKUP(A34,Calendar!$A$3:$G$459,2,FALSE)))","v":""},null,null,null,null,0,null,null,""]
[527,null,{"$f":"IF(ISNA(IF(Summary!$B$5=3,IF(VLOOKUP(A35,Calendar!$A$3:$G$459,7,FALSE)=\"S\", \"\", VLOOKUP(A35,Calendar!$A$3:$G$459,7,FALSE)),IF(VLOOKUP(A35,Calendar!$A$3:$G$459,4,FALSE)=\"S\", \"\", VLOOKUP(A35,Calendar!$A$3:$G$459,4,FALSE)))),\"\",IF(Summary!$B$5=3,IF(VLOOKUP(A35,Calendar!$A$3:$G$459,7,FALSE)=\"S\", \"\", VLOOKUP(A35,Calendar!$A$3:$G$459,7,FALSE)),IF(VLOOKUP(A35,Calendar!$A$3:$G$459,4,FALSE)=\"S\", \"\", VLOOKUP(A35,Calendar!$A$3:$G$459,4,FALSE))))","v":"M"},{"$f":"IF(Summary!$B$5=3,IF(C35=\"\",\"\",VLOOKUP(A35,Calendar!$A$3:$G$459,5,FALSE)),IF(C35=\"\",\"\",VLOOKUP(A35,Calendar!$A$3:$G$459,2,FALSE)))","v":"2019-05-27"},null,null,null,null,0,null,null,""]
[528,null,{"$f":"IF(ISNA(IF(Summary!$B$5=3,IF(VLOOKUP(A36,Calendar!$A$3:$G$459,7,FALSE)=\"S\", \"\", VLOOKUP(A36,Calendar!$A$3:$G$459,7,FALSE)),IF(VLOOKUP(A36,Calendar!$A$3:$G$459,4,FALSE)=\"S\", \"\", VLOOKUP(A36,Calendar!$A$3:$G$459,4,FALSE)))),\"\",IF(Summary!$B$5=3,IF(VLOOKUP(A36,Calendar!$A$3:$G$459,7,FALSE)=\"S\", \"\", VLOOKUP(A36,Calendar!$A$3:$G$459,7,FALSE)),IF(VLOOKUP(A36,Calendar!$A$3:$G$459,4,FALSE)=\"S\", \"\", VLOOKUP(A36,Calendar!$A$3:$G$459,4,FALSE))))","v":"T"},{"$f":"IF(Summary!$B$5=3,IF(C36=\"\",\"\",VLOOKUP(A36,Calendar!$A$3:$G$459,5,FALSE)),IF(C36=\"\",\"\",VLOOKUP(A36,Calendar!$A$3:$G$459,2,FALSE)))","v":"2019-05-28"},null,null,null,null,0,null,null,""]
[529,null,{"$f":"IF(ISNA(IF(Summary!$B$5=3,IF(VLOOKUP(A37,Calendar!$A$3:$G$459,7,FALSE)=\"S\", \"\", VLOOKUP(A37,Calendar!$A$3:$G$459,7,FALSE)),IF(VLOOKUP(A37,Calendar!$A$3:$G$459,4,FALSE)=\"S\", \"\", VLOOKUP(A37,Calendar!$A$3:$G$459,4,FALSE)))),\"\",IF(Summary!$B$5=3,IF(VLOOKUP(A37,Calendar!$A$3:$G$459,7,FALSE)=\"S\", \"\", VLOOKUP(A37,Calendar!$A$3:$G$459,7,FALSE)),IF(VLOOKUP(A37,Calendar!$A$3:$G$459,4,FALSE)=\"S\", \"\", VLOOKUP(A37,Calendar!$A$3:$G$459,4,FALSE))))","v":"W"},{"$f":"IF(Summary!$B$5=3,IF(C37=\"\",\"\",VLOOKUP(A37,Calendar!$A$3:$G$459,5,FALSE)),IF(C37=\"\",\"\",VLOOKUP(A37,Calendar!$A$3:$G$459,2,FALSE)))","v":"2019-05-29"},null,null,null,null,0,null,null,""]
[530,null,{"$f":"IF(ISNA(IF(Summary!$B$5=3,IF(VLOOKUP(A38,Calendar!$A$3:$G$459,7,FALSE)=\"S\", \"\", VLOOKUP(A38,Calendar!$A$3:$G$459,7,FALSE)),IF(VLOOKUP(A38,Calendar!$A$3:$G$459,4,FALSE)=\"S\", \"\", VLOOKUP(A38,Calendar!$A$3:$G$459,4,FALSE)))),\"\",IF(Summary!$B$5=3,IF(VLOOKUP(A38,Calendar!$A$3:$G$459,7,FALSE)=\"S\", \"\", VLOOKUP(A38,Calendar!$A$3:$G$459,7,FALSE)),IF(VLOOKUP(A38,Calendar!$A$3:$G$459,4,FALSE)=\"S\", \"\", VLOOKUP(A38,Calendar!$A$3:$G$459,4,FALSE))))","v":"R"},{"$f":"IF(Summary!$B$5=3,IF(C38=\"\",\"\",VLOOKUP(A38,Calendar!$A$3:$G$459,5,FALSE)),IF(C38=\"\",\"\",VLOOKUP(A38,Calendar!$A$3:$G$459,2,FALSE)))","v":"2019-05-30"},null,null,null,null,0,null,null,""]
[531,null,{"$f":"IF(ISNA(IF(Summary!$B$5=3,IF(VLOOKUP(A39,Calendar!$A$3:$G$459,7,FALSE)=\"S\", \"\", VLOOKUP(A39,Calendar!$A$3:$G$459,7,FALSE)),IF(VLOOKUP(A39,Calendar!$A$3:$G$459,4,FALSE)=\"S\", \"\", VLOOKUP(A39,Calendar!$A$3:$G$459,4,FALSE)))),\"\",IF(Summary!$B$5=3,IF(VLOOKUP(A39,Calendar!$A$3:$G$459,7,FALSE)=\"S\", \"\", VLOOKUP(A39,Calendar!$A$3:$G$459,7,FALSE)),IF(VLOOKUP(A39,Calendar!$A$3:$G$459,4,FALSE)=\"S\", \"\", VLOOKUP(A39,Calendar!$A$3:$G$459,4,FALSE))))","v":"F"},{"$f":"IF(Summary!$B$5=3,IF(C39=\"\",\"\",VLOOKUP(A39,Calendar!$A$3:$G$459,5,FALSE)),IF(C39=\"\",\"\",VLOOKUP(A39,Calendar!$A$3:$G$459,2,FALSE)))","v":"2019-05-31"},null,null,null,null,0,null,null,""]
[null,null,null,"Total Minutes",{"$f":"SUM(E9:E39)","v":0},{"$f":"SUM(F9:F39)","v":0},0,0,0,null,null,{"$f":"IF(SUM(E40:H40)>COUNTA(E9:E39)*390,\"The sum total for all cost objectives exceeds the maximum anticipated value based upon the number of days worked. Confirm minutes claimed for each day.\",\"\")","v":""}]
[null,null,null,"Total Hours",{"$f":"E40/60","v":0},{"$f":"F40/60","v":0},0,0,0]
[]
[]
[null,null,"Personnel Activity Report"]
[null,null,"Extended School Year"]
[null,null,"June"]
[602,null,{"$f":"IF(Summary!$E$8<>\"\",Summary!$E$8,\" \")","v":" "},null,null,null,null,null,null,null,null,{"$f":"IF(I51>390, \"<<< Day exceeds 390 minutes. Confirm reported time.\",\"\")","v":""}]
[603,null,{"$f":"IF(Summary!$E$9<>\"\",Summary!$E$9,\" \")","v":" "},null,null,null,null,null,null,null,null,""]
[604,null,"Day","Date","Special Ed","General Ed","Other","Other","Totals",null,null,""]
[605,null,{"$f":"IF(ISNA(IF(Summary!$B$5=3,IF(VLOOKUP(A46,Calendar!$A$3:$G$459,7,FALSE)=\"S\", \"\", VLOOKUP(A46,Calendar!$A$3:$G$459,7,FALSE)),IF(VLOOKUP(A46,Calendar!$A$3:$G$459,4,FALSE)=\"S\", \"\", VLOOKUP(A46,Calendar!$A$3:$G$459,4,FALSE)))),\"\",IF(Summary!$B$5=3,IF(VLOOKUP(A46,Calendar!$A$3:$G$459,7,FALSE)=\"S\", \"\", VLOOKUP(A46,Calendar!$A$3:$G$459,7,FALSE)),IF(VLOOKUP(A46,Calendar!$A$3:$G$459,4,FALSE)=\"S\", \"\", VLOOKUP(A46,Calendar!$A$3:$G$459,4,FALSE))))","v":""},{"$f":"IF(Summary!$B$5=3,IF(C50=\"\",\"\",VLOOKUP(A46,Calendar!$A$3:$G$459,5,FALSE)),IF(C50=\"\",\"\",VLOOKUP(A46,Calendar!$A$3:$G$459,2,FALSE)))","v":""},null,null,null,null,{"$f":"MIN(1440,SUM(E50:H50))","v":0},null,null,""]
[606,null,{"$f":"IF(ISNA(IF(Summary!$B$5=3,IF(VLOOKUP(A47,Calendar!$A$3:$G$459,7,FALSE)=\"S\", \"\", VLOOKUP(A47,Calendar!$A$3:$G$459,7,FALSE)),IF(VLOOKUP(A47,Calendar!$A$3:$G$459,4,FALSE)=\"S\", \"\", VLOOKUP(A47,Calendar!$A$3:$G$459,4,FALSE)))),\"\",IF(Summary!$B$5=3,IF(VLOOKUP(A47,Calendar!$A$3:$G$459,7,FALSE)=\"S\", \"\", VLOOKUP(A47,Calendar!$A$3:$G$459,7,FALSE)),IF(VLOOKUP(A47,Calendar!$A$3:$G$459,4,FALSE)=\"S\", \"\", VLOOKUP(A47,Calendar!$A$3:$G$459,4,FALSE))))","v":""},{"$f":"IF(Summary!$B$5=3,IF(C51=\"\",\"\",VLOOKUP(A47,Calendar!$A$3:$G$459,5,FALSE)),IF(C51=\"\",\"\",VLOOKUP(A47,Calendar!$A$3:$G$459,2,FALSE)))","v":""},null,null,null,null,{"$f":"MIN(1440,SUM(E51:H51))","v":0},null,null,""]
[607,null,{"$f":"IF(ISNA(IF(Summary!$B$5=3,IF(VLOOKUP(A48,Calendar!$A$3:$G$459,7,FALSE)=\"S\", \"\", VLOOKUP(A48,Calendar!$A$3:$G$459,7,FALSE)),IF(VLOOKUP(A48,Calendar!$A$3:$G$459,4,FALSE)=\"S\", \"\", VLOOKUP(A48,Calendar!$A$3:$G$459,4,FALSE)))),\"\",IF(Summary!$B$5=3,IF(VLOOKUP(A48,Calendar!$A$3:$G$459,7,FALSE)=\"S\", \"\", VLOOKUP(A48,Calendar!$A$3:$G$459,7,FALSE)),IF(VLOOKUP(A48,Calendar!$A$3:$G$459,4,FALSE)=\"S\", \"\", VLOOKUP(A48,Calendar!$A$3:$G$459,4,FALSE))))","v":"M"},{"$f":"IF(Summary!$B$5=3,IF(C52=\"\",\"\",VLOOKUP(A48,Calendar!$A$3:$G$459,5,FALSE)),IF(C52=\"\",\"\",VLOOKUP(A48,Calendar!$A$3:$G$459,2,FALSE)))","v":"2019-06-03"},null,null,null,null,0,null,null,""]
[608,null,{"$f":"IF(ISNA(IF(Summary!$B$5=3,IF(VLOOKUP(A49,Calendar!$A$3:$G$459,7,FALSE)=\"S\", \"\", VLOOKUP(A49,Calendar!$A$3:$G$459,7,FALSE)),IF(VLOOKUP(A49,Calendar!$A$3:$G$459,4,FALSE)=\"S\", \"\", VLOOKUP(A49,Calendar!$A$3:$G$459,4,FALSE)))),\"\",IF(Summary!$B$5=3,IF(VLOOKUP(A49,Calendar!$A$3:$G$459,7,FALSE)=\"S\", \"\", VLOOKUP(A49,Calendar!$A$3:$G$459,7,FALSE)),IF(VLOOKUP(A49,Calendar!$A$3:$G$459,4,FALSE)=\"S\", \"\", VLOOKUP(A49,Calendar!$A$3:$G$459,4,FALSE))))","v":"T"},{"$f":"IF(Summary!$B$5=3,IF(C53=\"\",\"\",VLOOKUP(A49,Calendar!$A$3:$G$459,5,FALSE)),IF(C53=\"\",\"\",VLOOKUP(A49,Calendar!$A$3:$G$459,2,FALSE)))","v":"2019-06-04"},null,null,null,null,0,null,null,""]
[609,null,{"$f":"IF(ISNA(IF(Summary!$B$5=3,IF(VLOOKUP(A50,Calendar!$A$3:$G$459,7,FALSE)=\"S\", \"\", VLOOKUP(A50,Calendar!$A$3:$G$459,7,FALSE)),IF(VLOOKUP(A50,Calendar!$A$3:$G$459,4,FALSE)=\"S\", \"\", VLOOKUP(A50,Calendar!$A$3:$G$459,4,FALSE)))),\"\",IF(Summary!$B$5=3,IF(VLOOKUP(A50,Calendar!$A$3:$G$459,7,FALSE)=\"S\", \"\", VLOOKUP(A50,Calendar!$A$3:$G$459,7,FALSE)),IF(VLOOKUP(A50,Calendar!$A$3:$G$459,4,FALSE)=\"S\", \"\", VLOOKUP(A50,Calendar!$A$3:$G$459,4,FALSE))))","v":"W"},{"$f":"IF(Summary!$B$5=3,IF(C54=\"\",\"\",VLOOKUP(A50,Calendar!$A$3:$G$459,5,FALSE)),IF(C54=\"\",\"\",VLOOKUP(A50,Calendar!$A$3:$G$459,2,FALSE)))","v":"2019-06-05"},null,null,null,null,0,null,null,""]
[610,null,{"$f":"IF(ISNA(IF(Summary!$B$5=3,IF(VLOOKUP(A51,Calendar!$A$3:$G$459,7,FALSE)=\"S\", \"\", VLOOKUP(A51,Calendar!$A$3:$G$459,7,FALSE)),IF(VLOOKUP(A51,Calendar!$A$3:$G$459,4,FALSE)=\"S\", \"\", VLOOKUP(A51,Calendar!$A$3:$G$459,4,FALSE)))),\"\",IF(Summary!$B$5=3,IF(VLOOKUP(A51,Calendar!$A$3:$G$459,7,FALSE)=\"S\", \"\", VLOOKUP(A51,Calendar!$A$3:$G$459,7,FALSE)),IF(VLOOKUP(A51,Calendar!$A$3:$G$459,4,FALSE)=\"S\", \"\", VLOOKUP(A51,Calendar!$A$3:$G$459,4,FALSE))))","v":"R"},{"$f":"IF(Summary!$B$5=3,IF(C55=\"\",\"\",VLOOKUP(A51,Calendar!$A$3:$G$459,5,FALSE)),IF(C55=\"\",\"\",VLOOKUP(A51,Calendar!$A$3:$G$459,2,FALSE)))","v":"2019-06-06"},null,null,null,null,0,null,null,""]
[611,null,{"$f":"IF(ISNA(IF(Summary!$B$5=3,IF(VLOOKUP(A52,Calendar!$A$3:$G$459,7,FALSE)=\"S\", \"\", VLOOKUP(A52,Calendar!$A$3:$G$459,7,FALSE)),IF(VLOOKUP(A52,Calendar!$A$3:$G$459,4,FALSE)=\"S\", \"\", VLOOKUP(A52,Calendar!$A$3:$G$459,4,FALSE)))),\"\",IF(Summary!$B$5=3,IF(VLOOKUP(A52,Calendar!$A$3:$G$459,7,FALSE)=\"S\", \"\", VLOOKUP(A52,Calendar!$A$3:$G$459,7,FALSE)),IF(VLOOKUP(A52,Calendar!$A$3:$G$459,4,FALSE)=\"S\", \"\", VLOOKUP(A52,Calendar!$A$3:$G$459,4,FALSE))))","v":"F"},{"$f":"IF(Summary!$B$5=3,IF(C56=\"\",\"\",VLOOKUP(A52,Calendar!$A$3:$G$459,5,FALSE)),IF(C56=\"\",\"\",VLOOKUP(A52,Calendar!$A$3:$G$459,2,FALSE)))","v":"2019-06-07"},null,null,null,null,0,null,null,""]
[612,null,{"$f":"IF(ISNA(IF(Summary!$B$5=3,IF(VLOOKUP(A53,Calendar!$A$3:$G$459,7,FALSE)=\"S\", \"\", VLOOKUP(A53,Calendar!$A$3:$G$459,7,FALSE)),IF(VLOOKUP(A53,Calendar!$A$3:$G$459,4,FALSE)=\"S\", \"\", VLOOKUP(A53,Calendar!$A$3:$G$459,4,FALSE)))),\"\",IF(Summary!$B$5=3,IF(VLOOKUP(A53,Calendar!$A$3:$G$459,7,FALSE)=\"S\", \"\", VLOOKUP(A53,Calendar!$A$3:$G$459,7,FALSE)),IF(VLOOKUP(A53,Calendar!$A$3:$G$459,4,FALSE)=\"S\", \"\", VLOOKUP(A53,Calendar!$A$3:$G$459,4,FALSE))))","v":""},{"$f":"IF(Summary!$B$5=3,IF(C57=\"\",\"\",VLOOKUP(A53,Calendar!$A$3:$G$459,5,FALSE)),IF(C57=\"\",\"\",VLOOKUP(A53,Calendar!$A$3:$G$459,2,FALSE)))","v":""},null,null,null,null,0,null,null,""]
[613,null,{"$f":"IF(ISNA(IF(Summary!$B$5=3,IF(VLOOKUP(A54,Calendar!$A$3:$G$459,7,FALSE)=\"S\", \"\", VLOOKUP(A54,Calendar!$A$3:$G$459,7,FALSE)),IF(VLOOKUP(A54,Calendar!$A$3:$G$459,4,FALSE)=\"S\", \"\", VLOOKUP(A54,Calendar!$A$3:$G$459,4,FALSE)))),\"\",IF(Summary!$B$5=3,IF(VLOOKUP(A54,Calendar!$A$3:$G$459,7,FALSE)=\"S\", \"\", VLOOKUP(A54,Calendar!$A$3:$G$459,7,FALSE)),IF(VLOOKUP(A54,Calendar!$A$3:$G$459,4,FALSE)=\"S\", \"\", VLOOKUP(A54,Calendar!$A$3:$G$459,4,FALSE))))","v":""},{"$f":"IF(Summary!$B$5=3,IF(C58=\"\",\"\",VLOOKUP(A54,Calendar!$A$3:$G$459,5,FALSE)),IF(C58=\"\",\"\",VLOOKUP(A54,Calendar!$A$3:$G$459,2,FALSE)))","v":""},null,null,null,null,0,null,null,""]
[614,null,{"$f":"IF(ISNA(IF(Summary!$B$5=3,IF(VLOOKUP(A55,Calendar!$A$3:$G$459,7,FALSE)=\"S\", \"\", VLOOKUP(A55,Calendar!$A$3:$G$459,7,FALSE)),IF(VLOOKUP(A55,Calendar!$A$3:$G$459,4,FALSE)=\"S\", \"\", VLOOKUP(A55,Calendar!$A$3:$G$459,4,FALSE)))),\"\",IF(Summary!$B$5=3,IF(VLOOKUP(A55,Calendar!$A$3:$G$459,7,FALSE)=\"S\", \"\", VLOOKUP(A55,Calendar!$A$3:$G$459,7,FALSE)),IF(VLOOKUP(A55,Calendar!$A$3:$G$459,4,FALSE)=\"S\", \"\", VLOOKUP(A55,Calendar!$A$3:$G$459,4,FALSE))))","v":"M"},{"$f":"IF(Summary!$B$5=3,IF(C59=\"\",\"\",VLOOKUP(A55,Calendar!$A$3:$G$459,5,FALSE)),IF(C59=\"\",\"\",VLOOKUP(A55,Calendar!$A$3:$G$459,2,FALSE)))","v":"2019-06-10"},null,null,null,null,0,null,null,""]
[615,null,{"$f":"IF(ISNA(IF(Summary!$B$5=3,IF(VLOOKUP(A56,Calendar!$A$3:$G$459,7,FALSE)=\"S\", \"\", VLOOKUP(A56,Calendar!$A$3:$G$459,7,FALSE)),IF(VLOOKUP(A56,Calendar!$A$3:$G$459,4,FALSE)=\"S\", \"\", VLOOKUP(A56,Calendar!$A$3:$G$459,4,FALSE)))),\"\",IF(Summary!$B$5=3,IF(VLOOKUP(A56,Calendar!$A$3:$G$459,7,FALSE)=\"S\", \"\", VLOOKUP(A56,Calendar!$A$3:$G$459,7,FALSE)),IF(VLOOKUP(A56,Calendar!$A$3:$G$459,4,FALSE)=\"S\", \"\", VLOOKUP(A56,Calendar!$A$3:$G$459,4,FALSE))))","v":"T"},{"$f":"IF(Summary!$B$5=3,IF(C60=\"\",\"\",VLOOKUP(A56,Calendar!$A$3:$G$459,5,FALSE)),IF(C60=\"\",\"\",VLOOKUP(A56,Calendar!$A$3:$G$459,2,FALSE)))","v":"2019-06-11"},null,null,null,null,0,null,null,""]
[616,null,{"$f":"IF(ISNA(IF(Summary!$B$5=3,IF(VLOOKUP(A57,Calendar!$A$3:$G$459,7,FALSE)=\"S\", \"\", VLOOKUP(A57,Calendar!$A$3:$G$459,7,FALSE)),IF(VLOOKUP(A57,Calendar!$A$3:$G$459,4,FALSE)=\"S\", \"\", VLOOKUP(A57,Calendar!$A$3:$G$459,4,FALSE)))),\"\",IF(Summary!$B$5=3,IF(VLOOKUP(A57,Calendar!$A$3:$G$459,7,FALSE)=\"S\", \"\", VLOOKUP(A57,Calendar!$A$3:$G$459,7,FALSE)),IF(VLOOKUP(A57,Calendar!$A$3:$G$459,4,FALSE)=\"S\", \"\", VLOOKUP(A57,Calendar!$A$3:$G$459,4,FALSE))))","v":"W"},{"$f":"IF(Summary!$B$5=3,IF(C61=\"\",\"\",VLOOKUP(A57,Calendar!$A$3:$G$459,5,FALSE)),IF(C61=\"\",\"\",VLOOKUP(A57,Calendar!$A$3:$G$459,2,FALSE)))","v":"2019-06-12"},null,null,null,null,0,null,null,""]
[617,null,{"$f":"IF(ISNA(IF(Summary!$B$5=3,IF(VLOOKUP(A58,Calendar!$A$3:$G$459,7,FALSE)=\"S\", \"\", VLOOKUP(A58,Calendar!$A$3:$G$459,7,FALSE)),IF(VLOOKUP(A58,Calendar!$A$3:$G$459,4,FALSE)=\"S\", \"\", VLOOKUP(A58,Calendar!$A$3:$G$459,4,FALSE)))),\"\",IF(Summary!$B$5=3,IF(VLOOKUP(A58,Calendar!$A$3:$G$459,7,FALSE)=\"S\", \"\", VLOOKUP(A58,Calendar!$A$3:$G$459,7,FALSE)),IF(VLOOKUP(A58,Calendar!$A$3:$G$459,4,FALSE)=\"S\", \"\", VLOOKUP(A58,Calendar!$A$3:$G$459,4,FALSE))))","v":"R"},{"$f":"IF(Summary!$B$5=3,IF(C62=\"\",\"\",VLOOKUP(A58,Calendar!$A$3:$G$459,5,FALSE)),IF(C62=\"\",\"\",VLOOKUP(A58,Calendar!$A$3:$G$459,2,FALSE)))","v":"2019-06-13"},null,null,null,null,0,null,null,""]
[618,null,{"$f":"IF(ISNA(IF(Summary!$B$5=3,IF(VLOOKUP(A59,Calendar!$A$3:$G$459,7,FALSE)=\"S\", \"\", VLOOKUP(A59,Calendar!$A$3:$G$459,7,FALSE)),IF(VLOOKUP(A59,Calendar!$A$3:$G$459,4,FALSE)=\"S\", \"\", VLOOKUP(A59,Calendar!$A$3:$G$459,4,FALSE)))),\"\",IF(Summary!$B$5=3,IF(VLOOKUP(A59,Calendar!$A$3:$G$459,7,FALSE)=\"S\", \"\", VLOOKUP(A59,Calendar!$A$3:$G$459,7,FALSE)),IF(VLOOKUP(A59,Calendar!$A$3:$G$459,4,FALSE)=\"S\", \"\", VLOOKUP(A59,Calendar!$A$3:$G$459,4,FALSE))))","v":"F"},{"$f":"IF(Summary!$B$5=3,IF(C63=\"\",\"\",VLOOKUP(A59,Calendar!$A$3:$G$459,5,FALSE)),IF(C63=\"\",\"\",VLOOKUP(A59,Calendar!$A$3:$G$459,2,FALSE)))","v":"2019-06-14"},null,null,null,null,0,null,null,""]
[619,null,{"$f":"IF(ISNA(IF(Summary!$B$5=3,IF(VLOOKUP(A60,Calendar!$A$3:$G$459,7,FALSE)=\"S\", \"\", VLOOKUP(A60,Calendar!$A$3:$G$459,7,FALSE)),IF(VLOOKUP(A60,Calendar!$A$3:$G$459,4,FALSE)=\"S\", \"\", VLOOKUP(A60,Calendar!$A$3:$G$459,4,FALSE)))),\"\",IF(Summary!$B$5=3,IF(VLOOKUP(A60,Calendar!$A$3:$G$459,7,FALSE)=\"S\", \"\", VLOOKUP(A60,Calendar!$A$3:$G$459,7,FALSE)),IF(VLOOKUP(A60,Calendar!$A$3:$G$459,4,FALSE)=\"S\", \"\", VLOOKUP(A60,Calendar!$A$3:$G$459,4,FALSE))))","v":""},{"$f":"IF(Summary!$B$5=3,IF(C64=\"\",\"\",VLOOKUP(A60,Calendar!$A$3:$G$459,5,FALSE)),IF(C64=\"\",\"\",VLOOKUP(A60,Calendar!$A$3:$G$459,2,FALSE)))","v":""},null,null,null,null,0,null,null,""]
[620,null,{"$f":"IF(ISNA(IF(Summary!$B$5=3,IF(VLOOKUP(A61,Calendar!$A$3:$G$459,7,FALSE)=\"S\", \"\", VLOOKUP(A61,Calendar!$A$3:$G$459,7,FALSE)),IF(VLOOKUP(A61,Calendar!$A$3:$G$459,4,FALSE)=\"S\", \"\", VLOOKUP(A61,Calendar!$A$3:$G$459,4,FALSE)))),\"\",IF(Summary!$B$5=3,IF(VLOOKUP(A61,Calendar!$A$3:$G$459,7,FALSE)=\"S\", \"\", VLOOKUP(A61,Calendar!$A$3:$G$459,7,FALSE)),IF(VLOOKUP(A61,Calendar!$A$3:$G$459,4,FALSE)=\"S\", \"\", VLOOKUP(A61,Calendar!$A$3:$G$459,4,FALSE))))","v":""},{"$f":"IF(Summary!$B$5=3,IF(C65=\"\",\"\",VLOOKUP(A61,Calendar!$A$3:$G$459,5,FALSE)),IF(C65=\"\",\"\",VLOOKUP(A61,Calendar!$A$3:$G$459,2,FALSE)))","v":""},null,null,null,null,0,null,null,""]
[621,null,{"$f":"IF(ISNA(IF(Summary!$B$5=3,IF(VLOOKUP(A62,Calendar!$A$3:$G$459,7,FALSE)=\"S\", \"\", VLOOKUP(A62,Calendar!$A$3:$G$459,7,FALSE)),IF(VLOOKUP(A62,Calendar!$A$3:$G$459,4,FALSE)=\"S\", \"\", VLOOKUP(A62,Calendar!$A$3:$G$459,4,FALSE)))),\"\",IF(Summary!$B$5=3,IF(VLOOKUP(A62,Calendar!$A$3:$G$459,7,FALSE)=\"S\", \"\", VLOOKUP(A62,Calendar!$A$3:$G$459,7,FALSE)),IF(VLOOKUP(A62,Calendar!$A$3:$G$459,4,FALSE)=\"S\", \"\", VLOOKUP(A62,Calendar!$A$3:$G$459,4,FALSE))))","v":"M"},{"$f":"IF(Summary!$B$5=3,IF(C66=\"\",\"\",VLOOKUP(A62,Calendar!$A$3:$G$459,5,FALSE)),IF(C66=\"\",\"\",VLOOKUP(A62,Calendar!$A$3:$G$459,2,FALSE)))","v":"2019-06-17"},null,null,null,null,0,null,null,""]
[622,null,{"$f":"IF(ISNA(IF(Summary!$B$5=3,IF(VLOOKUP(A63,Calendar!$A$3:$G$459,7,FALSE)=\"S\", \"\", VLOOKUP(A63,Calendar!$A$3:$G$459,7,FALSE)),IF(VLOOKUP(A63,Calendar!$A$3:$G$459,4,FALSE)=\"S\", \"\", VLOOKUP(A63,Calendar!$A$3:$G$459,4,FALSE)))),\"\",IF(Summary!$B$5=3,IF(VLOOKUP(A63,Calendar!$A$3:$G$459,7,FALSE)=\"S\", \"\", VLOOKUP(A63,Calendar!$A$3:$G$459,7,FALSE)),IF(VLOOKUP(A63,Calendar!$A$3:$G$459,4,FALSE)=\"S\", \"\", VLOOKUP(A63,Calendar!$A$3:$G$459,4,FALSE))))","v":"T"},{"$f":"IF(Summary!$B$5=3,IF(C67=\"\",\"\",VLOOKUP(A63,Calendar!$A$3:$G$459,5,FALSE)),IF(C67=\"\",\"\",VLOOKUP(A63,Calendar!$A$3:$G$459,2,FALSE)))","v":"2019-06-18"},null,null,null,null,0,null,null,""]
[623,null,{"$f":"IF(ISNA(IF(Summary!$B$5=3,IF(VLOOKUP(A64,Calendar!$A$3:$G$459,7,FALSE)=\"S\", \"\", VLOOKUP(A64,Calendar!$A$3:$G$459,7,FALSE)),IF(VLOOKUP(A64,Calendar!$A$3:$G$459,4,FALSE)=\"S\", \"\", VLOOKUP(A64,Calendar!$A$3:$G$459,4,FALSE)))),\"\",IF(Summary!$B$5=3,IF(VLOOKUP(A64,Calendar!$A$3:$G$459,7,FALSE)=\"S\", \"\", VLOOKUP(A64,Calendar!$A$3:$G$459,7,FALSE)),IF(VLOOKUP(A64,Calendar!$A$3:$G$459,4,FALSE)=\"S\", \"\", VLOOKUP(A64,Calendar!$A$3:$G$459,4,FALSE))))","v":"W"},{"$f":"IF(Summary!$B$5=3,IF(C68=\"\",\"\",VLOOKUP(A64,Calendar!$A$3:$G$459,5,FALSE)),IF(C68=\"\",\"\",VLOOKUP(A64,Calendar!$A$3:$G$459,2,FALSE)))","v":"2019-06-19"},null,null,null,null,0,null,null,""]
[624,null,{"$f":"IF(ISNA(IF(Summary!$B$5=3,IF(VLOOKUP(A65,Calendar!$A$3:$G$459,7,FALSE)=\"S\", \"\", VLOOKUP(A65,Calendar!$A$3:$G$459,7,FALSE)),IF(VLOOKUP(A65,Calendar!$A$3:$G$459,4,FALSE)=\"S\", \"\", VLOOKUP(A65,Calendar!$A$3:$G$459,4,FALSE)))),\"\",IF(Summary!$B$5=3,IF(VLOOKUP(A65,Calendar!$A$3:$G$459,7,FALSE)=\"S\", \"\", VLOOKUP(A65,Calendar!$A$3:$G$459,7,FALSE)),IF(VLOOKUP(A65,Calendar!$A$3:$G$459,4,FALSE)=\"S\", \"\", VLOOKUP(A65,Calendar!$A$3:$G$459,4,FALSE))))","v":"R"},{"$f":"IF(Summary!$B$5=3,IF(C69=\"\",\"\",VLOOKUP(A65,Calendar!$A$3:$G$459,5,FALSE)),IF(C69=\"\",\"\",VLOOKUP(A65,Calendar!$A$3:$G$459,2,FALSE)))","v":"2019-06-20"},null,null,null,null,0,null,null,""]
[625,null,{"$f":"IF(ISNA(IF(Summary!$B$5=3,IF(VLOOKUP(A66,Calendar!$A$3:$G$459,7,FALSE)=\"S\", \"\", VLOOKUP(A66,Calendar!$A$3:$G$459,7,FALSE)),IF(VLOOKUP(A66,Calendar!$A$3:$G$459,4,FALSE)=\"S\", \"\", VLOOKUP(A66,Calendar!$A$3:$G$459,4,FALSE)))),\"\",IF(Summary!$B$5=3,IF(VLOOKUP(A66,Calendar!$A$3:$G$459,7,FALSE)=\"S\", \"\", VLOOKUP(A66,Calendar!$A$3:$G$459,7,FALSE)),IF(VLOOKUP(A66,Calendar!$A$3:$G$459,4,FALSE)=\"S\", \"\", VLOOKUP(A66,Calendar!$A$3:$G$459,4,FALSE))))","v":"F"},{"$f":"IF(Summary!$B$5=3,IF(C70=\"\",\"\",VLOOKUP(A66,Calendar!$A$3:$G$459,5,FALSE)),IF(C70=\"\",\"\",VLOOKUP(A66,Calendar!$A$3:$G$459,2,FALSE)))","v":"2019-06-21"},null,null,null,null,0,null,null,""]
[626,null,{"$f":"IF(ISNA(IF(Summary!$B$5=3,IF(VLOOKUP(A67,Calendar!$A$3:$G$459,7,FALSE)=\"S\", \"\", VLOOKUP(A67,Calendar!$A$3:$G$459,7,FALSE)),IF(VLOOKUP(A67,Calendar!$A$3:$G$459,4,FALSE)=\"S\", \"\", VLOOKUP(A67,Calendar!$A$3:$G$459,4,FALSE)))),\"\",IF(Summary!$B$5=3,IF(VLOOKUP(A67,Calendar!$A$3:$G$459,7,FALSE)=\"S\", \"\", VLOOKUP(A67,Calendar!$A$3:$G$459,7,FALSE)),IF(VLOOKUP(A67,Calendar!$A$3:$G$459,4,FALSE)=\"S\", \"\", VLOOKUP(A67,Calendar!$A$3:$G$459,4,FALSE))))","v":""},{"$f":"IF(Summary!$B$5=3,IF(C71=\"\",\"\",VLOOKUP(A67,Calendar!$A$3:$G$459,5,FALSE)),IF(C71=\"\",\"\",VLOOKUP(A67,Calendar!$A$3:$G$459,2,FALSE)))","v":""},null,null,null,null,0,null,null,""]
[627,null,{"$f":"IF(ISNA(IF(Summary!$B$5=3,IF(VLOOKUP(A68,Calendar!$A$3:$G$459,7,FALSE)=\"S\", \"\", VLOOKUP(A68,Calendar!$A$3:$G$459,7,FALSE)),IF(VLOOKUP(A68,Calendar!$A$3:$G$459,4,FALSE)=\"S\", \"\", VLOOKUP(A68,Calendar!$A$3:$G$459,4,FALSE)))),\"\",IF(Summary!$B$5=3,IF(VLOOKUP(A68,Calendar!$A$3:$G$459,7,FALSE)=\"S\", \"\", VLOOKUP(A68,Calendar!$A$3:$G$459,7,FALSE)),IF(VLOOKUP(A68,Calendar!$A$3:$G$459,4,FALSE)=\"S\", \"\", VLOOKUP(A68,Calendar!$A$3:$G$459,4,FALSE))))","v":""},{"$f":"IF(Summary!$B$5=3,IF(C72=\"\",\"\",VLOOKUP(A68,Calendar!$A$3:$G$459,5,FALSE)),IF(C72=\"\",\"\",VLOOKUP(A68,Calendar!$A$3:$G$459,2,FALSE)))","v":""},null,null,null,null,0,null,null,""]
[628,null,{"$f":"IF(ISNA(IF(Summary!$B$5=3,IF(VLOOKUP(A69,Calendar!$A$3:$G$459,7,FALSE)=\"S\", \"\", VLOOKUP(A69,Calendar!$A$3:$G$459,7,FALSE)),IF(VLOOKUP(A69,Calendar!$A$3:$G$459,4,FALSE)=\"S\", \"\", VLOOKUP(A69,Calendar!$A$3:$G$459,4,FALSE)))),\"\",IF(Summary!$B$5=3,IF(VLOOKUP(A69,Calendar!$A$3:$G$459,7,FALSE)=\"S\", \"\", VLOOKUP(A69,Calendar!$A$3:$G$459,7,FALSE)),IF(VLOOKUP(A69,Calendar!$A$3:$G$459,4,FALSE)=\"S\", \"\", VLOOKUP(A69,Calendar!$A$3:$G$459,4,FALSE))))","v":"M"},{"$f":"IF(Summary!$B$5=3,IF(C73=\"\",\"\",VLOOKUP(A69,Calendar!$A$3:$G$459,5,FALSE)),IF(C73=\"\",\"\",VLOOKUP(A69,Calendar!$A$3:$G$459,2,FALSE)))","v":"2019-06-24"},null,null,null,null,0,null,null,""]
[629,null,{"$f":"IF(ISNA(IF(Summary!$B$5=3,IF(VLOOKUP(A70,Calendar!$A$3:$G$459,7,FALSE)=\"S\", \"\", VLOOKUP(A70,Calendar!$A$3:$G$459,7,FALSE)),IF(VLOOKUP(A70,Calendar!$A$3:$G$459,4,FALSE)=\"S\", \"\", VLOOKUP(A70,Calendar!$A$3:$G$459,4,FALSE)))),\"\",IF(Summary!$B$5=3,IF(VLOOKUP(A70,Calendar!$A$3:$G$459,7,FALSE)=\"S\", \"\", VLOOKUP(A70,Calendar!$A$3:$G$459,7,FALSE)),IF(VLOOKUP(A70,Calendar!$A$3:$G$459,4,FALSE)=\"S\", \"\", VLOOKUP(A70,Calendar!$A$3:$G$459,4,FALSE))))","v":"T"},{"$f":"IF(Summary!$B$5=3,IF(C74=\"\",\"\",VLOOKUP(A70,Calendar!$A$3:$G$459,5,FALSE)),IF(C74=\"\",\"\",VLOOKUP(A70,Calendar!$A$3:$G$459,2,FALSE)))","v":"2019-06-25"},null,null,null,null,0,null,null,""]
[630,null,{"$f":"IF(ISNA(IF(Summary!$B$5=3,IF(VLOOKUP(A71,Calendar!$A$3:$G$459,7,FALSE)=\"S\", \"\", VLOOKUP(A71,Calendar!$A$3:$G$459,7,FALSE)),IF(VLOOKUP(A71,Calendar!$A$3:$G$459,4,FALSE)=\"S\", \"\", VLOOKUP(A71,Calendar!$A$3:$G$459,4,FALSE)))),\"\",IF(Summary!$B$5=3,IF(VLOOKUP(A71,Calendar!$A$3:$G$459,7,FALSE)=\"S\", \"\", VLOOKUP(A71,Calendar!$A$3:$G$459,7,FALSE)),IF(VLOOKUP(A71,Calendar!$A$3:$G$459,4,FALSE)=\"S\", \"\", VLOOKUP(A71,Calendar!$A$3:$G$459,4,FALSE))))","v":"W"},{"$f":"IF(Summary!$B$5=3,IF(C75=\"\",\"\",VLOOKUP(A71,Calendar!$A$3:$G$459,5,FALSE)),IF(C75=\"\",\"\",VLOOKUP(A71,Calendar!$A$3:$G$459,2,FALSE)))","v":"2019-06-26"},null,null,null,null,0,null,null,""]
[null,null,{"$f":"IF(ISNA(IF(Summary!$B$5=3,IF(VLOOKUP(A72,Calendar!$A$3:$G$459,7,FALSE)=\"S\", \"\", VLOOKUP(A72,Calendar!$A$3:$G$459,7,FALSE)),IF(VLOOKUP(A72,Calendar!$A$3:$G$459,4,FALSE)=\"S\", \"\", VLOOKUP(A72,Calendar!$A$3:$G$459,4,FALSE)))),\"\",IF(Summary!$B$5=3,IF(VLOOKUP(A72,Calendar!$A$3:$G$459,7,FALSE)=\"S\", \"\", VLOOKUP(A72,Calendar!$A$3:$G$459,7,FALSE)),IF(VLOOKUP(A72,Calendar!$A$3:$G$459,4,FALSE)=\"S\", \"\", VLOOKUP(A72,Calendar!$A$3:$G$459,4,FALSE))))","v":"R"},{"$f":"IF(Summary!$B$5=3,IF(C76=\"\",\"\",VLOOKUP(A72,Calendar!$A$3:$G$459,5,FALSE)),IF(C76=\"\",\"\",VLOOKUP(A72,Calendar!$A$3:$G$459,2,FALSE)))","v":"2019-06-27"},null,null,null,null,0,null,null,""]
[null,null,{"$f":"IF(ISNA(IF(Summary!$B$5=3,IF(VLOOKUP(A73,Calendar!$A$3:$G$459,7,FALSE)=\"S\", \"\", VLOOKUP(A73,Calendar!$A$3:$G$459,7,FALSE)),IF(VLOOKUP(A73,Calendar!$A$3:$G$459,4,FALSE)=\"S\", \"\", VLOOKUP(A73,Calendar!$A$3:$G$459,4,FALSE)))),\"\",IF(Summary!$B$5=3,IF(VLOOKUP(A73,Calendar!$A$3:$G$459,7,FALSE)=\"S\", \"\", VLOOKUP(A73,Calendar!$A$3:$G$459,7,FALSE)),IF(VLOOKUP(A73,Calendar!$A$3:$G$459,4,FALSE)=\"S\", \"\", VLOOKUP(A73,Calendar!$A$3:$G$459,4,FALSE))))","v":"F"},{"$f":"IF(Summary!$B$5=3,IF(C77=\"\",\"\",VLOOKUP(A73,Calendar!$A$3:$G$459,5,FALSE)),IF(C77=\"\",\"\",VLOOKUP(A73,Calendar!$A$3:$G$459,2,FALSE)))","v":"2019-06-28"},null,null,null,null,0,null,null,{"$f":"IF(SUM(E81:H81)>COUNTA(E50:E80)*390,\"The sum total for all cost objectives exceeds the maximum anticipated value based upon the number of days worked. Confirm minutes claimed for each day.\",\"\")","v":""}]
[null,null,{"$f":"IF(ISNA(IF(Summary!$B$5=3,IF(VLOOKUP(A74,Calendar!$A$3:$G$459,7,FALSE)=\"S\", \"\", VLOOKUP(A74,Calendar!$A$3:$G$459,7,FALSE)),IF(VLOOKUP(A74,Calendar!$A$3:$G$459,4,FALSE)=\"S\", \"\", VLOOKUP(A74,Calendar!$A$3:$G$459,4,FALSE)))),\"\",IF(Summary!$B$5=3,IF(VLOOKUP(A74,Calendar!$A$3:$G$459,7,FALSE)=\"S\", \"\", VLOOKUP(A74,Calendar!$A$3:$G$459,7,FALSE)),IF(VLOOKUP(A74,Calendar!$A$3:$G$459,4,FALSE)=\"S\", \"\", VLOOKUP(A74,Calendar!$A$3:$G$459,4,FALSE))))","v":""},{"$f":"IF(Summary!$B$5=3,IF(C78=\"\",\"\",VLOOKUP(A74,Calendar!$A$3:$G$459,5,FALSE)),IF(C78=\"\",\"\",VLOOKUP(A74,Calendar!$A$3:$G$459,2,FALSE)))","v":""},null,null,null,null,0]
[null,null,{"$f":"IF(ISNA(IF(Summary!$B$5=3,IF(VLOOKUP(A75,Calendar!$A$3:$G$459,7,FALSE)=\"S\", \"\", VLOOKUP(A75,Calendar!$A$3:$G$459,7,FALSE)),IF(VLOOKUP(A75,Calendar!$A$3:$G$459,4,FALSE)=\"S\", \"\", VLOOKUP(A75,Calendar!$A$3:$G$459,4,FALSE)))),\"\",IF(Summary!$B$5=3,IF(VLOOKUP(A75,Calendar!$A$3:$G$459,7,FALSE)=\"S\", \"\", VLOOKUP(A75,Calendar!$A$3:$G$459,7,FALSE)),IF(VLOOKUP(A75,Calendar!$A$3:$G$459,4,FALSE)=\"S\", \"\", VLOOKUP(A75,Calendar!$A$3:$G$459,4,FALSE))))","v":""},{"$f":"IF(Summary!$B$5=3,IF(C79=\"\",\"\",VLOOKUP(A75,Calendar!$A$3:$G$459,5,FALSE)),IF(C79=\"\",\"\",VLOOKUP(A75,Calendar!$A$3:$G$459,2,FALSE)))","v":""},null,null,null,null,0]
[null,null,{"$f":"IF(ISNA(IF(Summary!$B$5=3,IF(VLOOKUP(A76,Calendar!$A$3:$G$459,7,FALSE)=\"S\", \"\", VLOOKUP(A76,Calendar!$A$3:$G$459,7,FALSE)),IF(VLOOKUP(A76,Calendar!$A$3:$G$459,4,FALSE)=\"S\", \"\", VLOOKUP(A76,Calendar!$A$3:$G$459,4,FALSE)))),\"\",IF(Summary!$B$5=3,IF(VLOOKUP(A76,Calendar!$A$3:$G$459,7,FALSE)=\"S\", \"\", VLOOKUP(A76,Calendar!$A$3:$G$459,7,FALSE)),IF(VLOOKUP(A76,Calendar!$A$3:$G$459,4,FALSE)=\"S\", \"\", VLOOKUP(A76,Calendar!$A$3:$G$459,4,FALSE))))","v":""},{"$f":"IF(Summary!$B$5=3,IF(C80=\"\",\"\",VLOOKUP(A76,Calendar!$A$3:$G$459,5,FALSE)),IF(C80=\"\",\"\",VLOOKUP(A76,Calendar!$A$3:$G$459,2,FALSE)))","v":""},null,null,null,null,0]
[null,null,null,"Total Minutes",{"$f":"SUM(E50:E80)","v":0},{"$f":"SUM(F50:F80)","v":0},{"$f":"SUM(G50:G80)","v":0},{"$f":"SUM(H50:H80)","v":0},{"$f":"SUM(I50:I80)","v":0}]
[null,null,null,"Total Hours",{"$f":"E81/60","v":0},{"$f":"F81/60","v":0},{"$f":"G81/60","v":0},{"$f":"H81/60","v":0},{"$f":"I81/60","v":0}]
[]
[]
[null,null,"Personnel Activity Report"]
[null,null,"Extended School Year"]
[701,null,"July",null,null,null,null,null,null,null,null,{"$f":"IF(I91>390, \"<<< Day exceeds 390 minutes. Confirm reported time.\",\"\")","v":""}]
[702,null,{"$f":"IF(Summary!$E$8<>\"\",Summary!$E$8,\" \")","v":" "},null,null,null,null,null,null,null,null,{"$f":"IF(I92>390, \"<<< Day exceeds 390 minutes. Confirm reported time.\",\"\")","v":""}]
[703,null,{"$f":"IF(Summary!$E$9<>\"\",Summary!$E$9,\" \")","v":" "},null,null,null,null,null,null,null,null,""]
[704,null,"Day","Date","Special Ed","General Ed","Other","Other","Totals",null,null,""]
[705,null,{"$f":"IF(ISNA(IF(Summary!$B$5=3,IF(VLOOKUP(A87,Calendar!$A$3:$G$459,7,FALSE)=\"S\", \"\", VLOOKUP(A87,Calendar!$A$3:$G$459,7,FALSE)),IF(VLOOKUP(A87,Calendar!$A$3:$G$459,4,FALSE)=\"S\", \"\", VLOOKUP(A87,Calendar!$A$3:$G$459,4,FALSE)))),\"\",IF(Summary!$B$5=3,IF(VLOOKUP(A87,Calendar!$A$3:$G$459,7,FALSE)=\"S\", \"\", VLOOKUP(A87,Calendar!$A$3:$G$459,7,FALSE)),IF(VLOOKUP(A87,Calendar!$A$3:$G$459,4,FALSE)=\"S\", \"\", VLOOKUP(A87,Calendar!$A$3:$G$459,4,FALSE))))","v":"M"},{"$f":"IF(Summary!$B$5=3,IF(C91=\"\",\"\",VLOOKUP(A87,Calendar!$A$3:$G$459,5,FALSE)),IF(C91=\"\",\"\",VLOOKUP(A87,Calendar!$A$3:$G$459,2,FALSE)))","v":"2019-07-01"},null,null,null,null,{"$f":"MIN(1440,SUM(E91:H91))","v":0},null,null,""]
[706,null,{"$f":"IF(ISNA(IF(Summary!$B$5=3,IF(VLOOKUP(A88,Calendar!$A$3:$G$459,7,FALSE)=\"S\", \"\", VLOOKUP(A88,Calendar!$A$3:$G$459,7,FALSE)),IF(VLOOKUP(A88,Calendar!$A$3:$G$459,4,FALSE)=\"S\", \"\", VLOOKUP(A88,Calendar!$A$3:$G$459,4,FALSE)))),\"\",IF(Summary!$B$5=3,IF(VLOOKUP(A88,Calendar!$A$3:$G$459,7,FALSE)=\"S\", \"\", VLOOKUP(A88,Calendar!$A$3:$G$459,7,FALSE)),IF(VLOOKUP(A88,Calendar!$A$3:$G$459,4,FALSE)=\"S\", \"\", VLOOKUP(A88,Calendar!$A$3:$G$459,4,FALSE))))","v":"T"},{"$f":"IF(Summary!$B$5=3,IF(C92=\"\",\"\",VLOOKUP(A88,Calendar!$A$3:$G$459,5,FALSE)),IF(C92=\"\",\"\",VLOOKUP(A88,Calendar!$A$3:$G$459,2,FALSE)))","v":"2019-07-02"},null,null,null,null,{"$f":"MIN(1440,SUM(E92:H92))","v":0},null,null,""]
[707,null,{"$f":"IF(ISNA(IF(Summary!$B$5=3,IF(VLOOKUP(A89,Calendar!$A$3:$G$459,7,FALSE)=\"S\", \"\", VLOOKUP(A89,Calendar!$A$3:$G$459,7,FALSE)),IF(VLOOKUP(A89,Calendar!$A$3:$G$459,4,FALSE)=\"S\", \"\", VLOOKUP(A89,Calendar!$A$3:$G$459,4,FALSE)))),\"\",IF(Summary!$B$5=3,IF(VLOOKUP(A89,Calendar!$A$3:$G$459,7,FALSE)=\"S\", \"\", VLOOKUP(A89,Calendar!$A$3:$G$459,7,FALSE)),IF(VLOOKUP(A89,Calendar!$A$3:$G$459,4,FALSE)=\"S\", \"\", VLOOKUP(A89,Calendar!$A$3:$G$459,4,FALSE))))","v":"W"},{"$f":"IF(Summary!$B$5=3,IF(C93=\"\",\"\",VLOOKUP(A89,Calendar!$A$3:$G$459,5,FALSE)),IF(C93=\"\",\"\",VLOOKUP(A89,Calendar!$A$3:$G$459,2,FALSE)))","v":"2019-07-03"},null,null,null,null,0,null,null,""]
[708,null,{"$f":"IF(ISNA(IF(Summary!$B$5=3,IF(VLOOKUP(A90,Calendar!$A$3:$G$459,7,FALSE)=\"S\", \"\", VLOOKUP(A90,Calendar!$A$3:$G$459,7,FALSE)),IF(VLOOKUP(A90,Calendar!$A$3:$G$459,4,FALSE)=\"S\", \"\", VLOOKUP(A90,Calendar!$A$3:$G$459,4,FALSE)))),\"\",IF(Summary!$B$5=3,IF(VLOOKUP(A90,Calendar!$A$3:$G$459,7,FALSE)=\"S\", \"\", VLOOKUP(A90,Calendar!$A$3:$G$459,7,FALSE)),IF(VLOOKUP(A90,Calendar!$A$3:$G$459,4,FALSE)=\"S\", \"\", VLOOKUP(A90,Calendar!$A$3:$G$459,4,FALSE))))","v":"R"},{"$f":"IF(Summary!$B$5=3,IF(C94=\"\",\"\",VLOOKUP(A90,Calendar!$A$3:$G$459,5,FALSE)),IF(C94=\"\",\"\",VLOOKUP(A90,Calendar!$A$3:$G$459,2,FALSE)))","v":"2019-07-04"},null,null,null,null,0,null,null,""]
[709,null,{"$f":"IF(ISNA(IF(Summary!$B$5=3,IF(VLOOKUP(A91,Calendar!$A$3:$G$459,7,FALSE)=\"S\", \"\", VLOOKUP(A91,Calendar!$A$3:$G$459,7,FALSE)),IF(VLOOKUP(A91,Calendar!$A$3:$G$459,4,FALSE)=\"S\", \"\", VLOOKUP(A91,Calendar!$A$3:$G$459,4,FALSE)))),\"\",IF(Summary!$B$5=3,IF(VLOOKUP(A91,Calendar!$A$3:$G$459,7,FALSE)=\"S\", \"\", VLOOKUP(A91,Calendar!$A$3:$G$459,7,FALSE)),IF(VLOOKUP(A91,Calendar!$A$3:$G$459,4,FALSE)=\"S\", \"\", VLOOKUP(A91,Calendar!$A$3:$G$459,4,FALSE))))","v":"F"},{"$f":"IF(Summary!$B$5=3,IF(C95=\"\",\"\",VLOOKUP(A91,Calendar!$A$3:$G$459,5,FALSE)),IF(C95=\"\",\"\",VLOOKUP(A91,Calendar!$A$3:$G$459,2,FALSE)))","v":"2019-07-05"},null,null,null,null,0,null,null,""]
[710,null,{"$f":"IF(ISNA(IF(Summary!$B$5=3,IF(VLOOKUP(A92,Calendar!$A$3:$G$459,7,FALSE)=\"S\", \"\", VLOOKUP(A92,Calendar!$A$3:$G$459,7,FALSE)),IF(VLOOKUP(A92,Calendar!$A$3:$G$459,4,FALSE)=\"S\", \"\", VLOOKUP(A92,Calendar!$A$3:$G$459,4,FALSE)))),\"\",IF(Summary!$B$5=3,IF(VLOOKUP(A92,Calendar!$A$3:$G$459,7,FALSE)=\"S\", \"\", VLOOKUP(A92,Calendar!$A$3:$G$459,7,FALSE)),IF(VLOOKUP(A92,Calendar!$A$3:$G$459,4,FALSE)=\"S\", \"\", VLOOKUP(A92,Calendar!$A$3:$G$459,4,FALSE))))","v":""},{"$f":"IF(Summary!$B$5=3,IF(C96=\"\",\"\",VLOOKUP(A92,Calendar!$A$3:$G$459,5,FALSE)),IF(C96=\"\",\"\",VLOOKUP(A92,Calendar!$A$3:$G$459,2,FALSE)))","v":""},null,null,null,null,0,null,null,""]
[711,null,{"$f":"IF(ISNA(IF(Summary!$B$5=3,IF(VLOOKUP(A93,Calendar!$A$3:$G$459,7,FALSE)=\"S\", \"\", VLOOKUP(A93,Calendar!$A$3:$G$459,7,FALSE)),IF(VLOOKUP(A93,Calendar!$A$3:$G$459,4,FALSE)=\"S\", \"\", VLOOKUP(A93,Calendar!$A$3:$G$459,4,FALSE)))),\"\",IF(Summary!$B$5=3,IF(VLOOKUP(A93,Calendar!$A$3:$G$459,7,FALSE)=\"S\", \"\", VLOOKUP(A93,Calendar!$A$3:$G$459,7,FALSE)),IF(VLOOKUP(A93,Calendar!$A$3:$G$459,4,FALSE)=\"S\", \"\", VLOOKUP(A93,Calendar!$A$3:$G$459,4,FALSE))))","v":""},{"$f":"IF(Summary!$B$5=3,IF(C97=\"\",\"\",VLOOKUP(A93,Calendar!$A$3:$G$459,5,FALSE)),IF(C97=\"\",\"\",VLOOKUP(A93,Calendar!$A$3:$G$459,2,FALSE)))","v":""},null,null,null,null,0,null,null,""]
[712,null,{"$f":"IF(ISNA(IF(Summary!$B$5=3,IF(VLOOKUP(A94,Calendar!$A$3:$G$459,7,FALSE)=\"S\", \"\", VLOOKUP(A94,Calendar!$A$3:$G$459,7,FALSE)),IF(VLOOKUP(A94,Calendar!$A$3:$G$459,4,FALSE)=\"S\", \"\", VLOOKUP(A94,Calendar!$A$3:$G$459,4,FALSE)))),\"\",IF(Summary!$B$5=3,IF(VLOOKUP(A94,Calendar!$A$3:$G$459,7,FALSE)=\"S\", \"\", VLOOKUP(A94,Calendar!$A$3:$G$459,7,FALSE)),IF(VLOOKUP(A94,Calendar!$A$3:$G$459,4,FALSE)=\"S\", \"\", VLOOKUP(A94,Calendar!$A$3:$G$459,4,FALSE))))","v":"M"},{"$f":"IF(Summary!$B$5=3,IF(C98=\"\",\"\",VLOOKUP(A94,Calendar!$A$3:$G$459,5,FALSE)),IF(C98=\"\",\"\",VLOOKUP(A94,Calendar!$A$3:$G$459,2,FALSE)))","v":"2019-07-08"},null,null,null,null,0,null,null,""]
[713,null,{"$f":"IF(ISNA(IF(Summary!$B$5=3,IF(VLOOKUP(A95,Calendar!$A$3:$G$459,7,FALSE)=\"S\", \"\", VLOOKUP(A95,Calendar!$A$3:$G$459,7,FALSE)),IF(VLOOKUP(A95,Calendar!$A$3:$G$459,4,FALSE)=\"S\", \"\", VLOOKUP(A95,Calendar!$A$3:$G$459,4,FALSE)))),\"\",IF(Summary!$B$5=3,IF(VLOOKUP(A95,Calendar!$A$3:$G$459,7,FALSE)=\"S\", \"\", VLOOKUP(A95,Calendar!$A$3:$G$459,7,FALSE)),IF(VLOOKUP(A95,Calendar!$A$3:$G$459,4,FALSE)=\"S\", \"\", VLOOKUP(A95,Calendar!$A$3:$G$459,4,FALSE))))","v":"T"},{"$f":"IF(Summary!$B$5=3,IF(C99=\"\",\"\",VLOOKUP(A95,Calendar!$A$3:$G$459,5,FALSE)),IF(C99=\"\",\"\",VLOOKUP(A95,Calendar!$A$3:$G$459,2,FALSE)))","v":"2019-07-09"},null,null,null,null,0,null,null,""]
[714,null,{"$f":"IF(ISNA(IF(Summary!$B$5=3,IF(VLOOKUP(A96,Calendar!$A$3:$G$459,7,FALSE)=\"S\", \"\", VLOOKUP(A96,Calendar!$A$3:$G$459,7,FALSE)),IF(VLOOKUP(A96,Calendar!$A$3:$G$459,4,FALSE)=\"S\", \"\", VLOOKUP(A96,Calendar!$A$3:$G$459,4,FALSE)))),\"\",IF(Summary!$B$5=3,IF(VLOOKUP(A96,Calendar!$A$3:$G$459,7,FALSE)=\"S\", \"\", VLOOKUP(A96,Calendar!$A$3:$G$459,7,FALSE)),IF(VLOOKUP(A96,Calendar!$A$3:$G$459,4,FALSE)=\"S\", \"\", VLOOKUP(A96,Calendar!$A$3:$G$459,4,FALSE))))","v":"W"},{"$f":"IF(Summary!$B$5=3,IF(C100=\"\",\"\",VLOOKUP(A96,Calendar!$A$3:$G$459,5,FALSE)),IF(C100=\"\",\"\",VLOOKUP(A96,Calendar!$A$3:$G$459,2,FALSE)))","v":"2019-07-10"},null,null,null,null,0,null,null,""]
[715,null,{"$f":"IF(ISNA(IF(Summary!$B$5=3,IF(VLOOKUP(A97,Calendar!$A$3:$G$459,7,FALSE)=\"S\", \"\", VLOOKUP(A97,Calendar!$A$3:$G$459,7,FALSE)),IF(VLOOKUP(A97,Calendar!$A$3:$G$459,4,FALSE)=\"S\", \"\", VLOOKUP(A97,Calendar!$A$3:$G$459,4,FALSE)))),\"\",IF(Summary!$B$5=3,IF(VLOOKUP(A97,Calendar!$A$3:$G$459,7,FALSE)=\"S\", \"\", VLOOKUP(A97,Calendar!$A$3:$G$459,7,FALSE)),IF(VLOOKUP(A97,Calendar!$A$3:$G$459,4,FALSE)=\"S\", \"\", VLOOKUP(A97,Calendar!$A$3:$G$459,4,FALSE))))","v":"R"},{"$f":"IF(Summary!$B$5=3,IF(C101=\"\",\"\",VLOOKUP(A97,Calendar!$A$3:$G$459,5,FALSE)),IF(C101=\"\",\"\",VLOOKUP(A97,Calendar!$A$3:$G$459,2,FALSE)))","v":"2019-07-11"},null,null,null,null,0,null,null,""]
[716,null,{"$f":"IF(ISNA(IF(Summary!$B$5=3,IF(VLOOKUP(A98,Calendar!$A$3:$G$459,7,FALSE)=\"S\", \"\", VLOOKUP(A98,Calendar!$A$3:$G$459,7,FALSE)),IF(VLOOKUP(A98,Calendar!$A$3:$G$459,4,FALSE)=\"S\", \"\", VLOOKUP(A98,Calendar!$A$3:$G$459,4,FALSE)))),\"\",IF(Summary!$B$5=3,IF(VLOOKUP(A98,Calendar!$A$3:$G$459,7,FALSE)=\"S\", \"\", VLOOKUP(A98,Calendar!$A$3:$G$459,7,FALSE)),IF(VLOOKUP(A98,Calendar!$A$3:$G$459,4,FALSE)=\"S\", \"\", VLOOKUP(A98,Calendar!$A$3:$G$459,4,FALSE))))","v":"F"},{"$f":"IF(Summary!$B$5=3,IF(C102=\"\",\"\",VLOOKUP(A98,Calendar!$A$3:$G$459,5,FALSE)),IF(C102=\"\",\"\",VLOOKUP(A98,Calendar!$A$3:$G$459,2,FALSE)))","v":"2019-07-12"},null,null,null,null,0,null,null,""]
[717,null,{"$f":"IF(ISNA(IF(Summary!$B$5=3,IF(VLOOKUP(A99,Calendar!$A$3:$G$459,7,FALSE)=\"S\", \"\", VLOOKUP(A99,Calendar!$A$3:$G$459,7,FALSE)),IF(VLOOKUP(A99,Calendar!$A$3:$G$459,4,FALSE)=\"S\", \"\", VLOOKUP(A99,Calendar!$A$3:$G$459,4,FALSE)))),\"\",IF(Summary!$B$5=3,IF(VLOOKUP(A99,Calendar!$A$3:$G$459,7,FALSE)=\"S\", \"\", VLOOKUP(A99,Calendar!$A$3:$G$459,7,FALSE)),IF(VLOOKUP(A99,Calendar!$A$3:$G$459,4,FALSE)=\"S\", \"\", VLOOKUP(A99,Calendar!$A$3:$G$459,4,FALSE))))","v":""},{"$f":"IF(Summary!$B$5=3,IF(C103=\"\",\"\",VLOOKUP(A99,Calendar!$A$3:$G$459,5,FALSE)),IF(C103=\"\",\"\",VLOOKUP(A99,Calendar!$A$3:$G$459,2,FALSE)))","v":""},null,null,null,null,0,null,null,""]
[718,null,{"$f":"IF(ISNA(IF(Summary!$B$5=3,IF(VLOOKUP(A100,Calendar!$A$3:$G$459,7,FALSE)=\"S\", \"\", VLOOKUP(A100,Calendar!$A$3:$G$459,7,FALSE)),IF(VLOOKUP(A100,Calendar!$A$3:$G$459,4,FALSE)=\"S\", \"\", VLOOKUP(A100,Calendar!$A$3:$G$459,4,FALSE)))),\"\",IF(Summary!$B$5=3,IF(VLOOKUP(A100,Calendar!$A$3:$G$459,7,FALSE)=\"S\", \"\", VLOOKUP(A100,Calendar!$A$3:$G$459,7,FALSE)),IF(VLOOKUP(A100,Calendar!$A$3:$G$459,4,FALSE)=\"S\", \"\", VLOOKUP(A100,Calendar!$A$3:$G$459,4,FALSE))))","v":""},{"$f":"IF(Summary!$B$5=3,IF(C104=\"\",\"\",VLOOKUP(A100,Calendar!$A$3:$G$459,5,FALSE)),IF(C104=\"\",\"\",VLOOKUP(A100,Calendar!$A$3:$G$459,2,FALSE)))","v":""},null,null,null,null,0,null,null,""]
[719,null,{"$f":"IF(ISNA(IF(Summary!$B$5=3,IF(VLOOKUP(A101,Calendar!$A$3:$G$459,7,FALSE)=\"S\", \"\", VLOOKUP(A101,Calendar!$A$3:$G$459,7,FALSE)),IF(VLOOKUP(A101,Calendar!$A$3:$G$459,4,FALSE)=\"S\", \"\", VLOOKUP(A101,Calendar!$A$3:$G$459,4,FALSE)))),\"\",IF(Summary!$B$5=3,IF(VLOOKUP(A101,Calendar!$A$3:$G$459,7,FALSE)=\"S\", \"\", VLOOKUP(A101,Calendar!$A$3:$G$459,7,FALSE)),IF(VLOOKUP(A101,Calendar!$A$3:$G$459,4,FALSE)=\"S\", \"\", VLOOKUP(A101,Calendar!$A$3:$G$459,4,FALSE))))","v":"M"},{"$f":"IF(Summary!$B$5=3,IF(C105=\"\",\"\",VLOOKUP(A101,Calendar!$A$3:$G$459,5,FALSE)),IF(C105=\"\",\"\",VLOOKUP(A101,Calendar!$A$3:$G$459,2,FALSE)))","v":"2019-07-15"},null,null,null,null,0,null,null,""]
[720,null,{"$f":"IF(ISNA(IF(Summary!$B$5=3,IF(VLOOKUP(A102,Calendar!$A$3:$G$459,7,FALSE)=\"S\", \"\", VLOOKUP(A102,Calendar!$A$3:$G$459,7,FALSE)),IF(VLOOKUP(A102,Calendar!$A$3:$G$459,4,FALSE)=\"S\", \"\", VLOOKUP(A102,Calendar!$A$3:$G$459,4,FALSE)))),\"\",IF(Summary!$B$5=3,IF(VLOOKUP(A102,Calendar!$A$3:$G$459,7,FALSE)=\"S\", \"\", VLOOKUP(A102,Calendar!$A$3:$G$459,7,FALSE)),IF(VLOOKUP(A102,Calendar!$A$3:$G$459,4,FALSE)=\"S\", \"\", VLOOKUP(A102,Calendar!$A$3:$G$459,4,FALSE))))","v":"T"},{"$f":"IF(Summary!$B$5=3,IF(C106=\"\",\"\",VLOOKUP(A102,Calendar!$A$3:$G$459,5,FALSE)),IF(C106=\"\",\"\",VLOOKUP(A102,Calendar!$A$3:$G$459,2,FALSE)))","v":"2019-07-16"},null,null,null,null,0,null,null,""]
[721,null,{"$f":"IF(ISNA(IF(Summary!$B$5=3,IF(VLOOKUP(A103,Calendar!$A$3:$G$459,7,FALSE)=\"S\", \"\", VLOOKUP(A103,Calendar!$A$3:$G$459,7,FALSE)),IF(VLOOKUP(A103,Calendar!$A$3:$G$459,4,FALSE)=\"S\", \"\", VLOOKUP(A103,Calendar!$A$3:$G$459,4,FALSE)))),\"\",IF(Summary!$B$5=3,IF(VLOOKUP(A103,Calendar!$A$3:$G$459,7,FALSE)=\"S\", \"\", VLOOKUP(A103,Calendar!$A$3:$G$459,7,FALSE)),IF(VLOOKUP(A103,Calendar!$A$3:$G$459,4,FALSE)=\"S\", \"\", VLOOKUP(A103,Calendar!$A$3:$G$459,4,FALSE))))","v":"W"},{"$f":"IF(Summary!$B$5=3,IF(C107=\"\",\"\",VLOOKUP(A103,Calendar!$A$3:$G$459,5,FALSE)),IF(C107=\"\",\"\",VLOOKUP(A103,Calendar!$A$3:$G$459,2,FALSE)))","v":"2019-07-17"},null,null,null,null,0,null,null,""]
[722,null,{"$f":"IF(ISNA(IF(Summary!$B$5=3,IF(VLOOKUP(A104,Calendar!$A$3:$G$459,7,FALSE)=\"S\", \"\", VLOOKUP(A104,Calendar!$A$3:$G$459,7,FALSE)),IF(VLOOKUP(A104,Calendar!$A$3:$G$459,4,FALSE)=\"S\", \"\", VLOOKUP(A104,Calendar!$A$3:$G$459,4,FALSE)))),\"\",IF(Summary!$B$5=3,IF(VLOOKUP(A104,Calendar!$A$3:$G$459,7,FALSE)=\"S\", \"\", VLOOKUP(A104,Calendar!$A$3:$G$459,7,FALSE)),IF(VLOOKUP(A104,Calendar!$A$3:$G$459,4,FALSE)=\"S\", \"\", VLOOKUP(A104,Calendar!$A$3:$G$459,4,FALSE))))","v":"R"},{"$f":"IF(Summary!$B$5=3,IF(C108=\"\",\"\",VLOOKUP(A104,Calendar!$A$3:$G$459,5,FALSE)),IF(C108=\"\",\"\",VLOOKUP(A104,Calendar!$A$3:$G$459,2,FALSE)))","v":"2019-07-18"},null,null,null,null,0,null,null,""]
[723,null,{"$f":"IF(ISNA(IF(Summary!$B$5=3,IF(VLOOKUP(A105,Calendar!$A$3:$G$459,7,FALSE)=\"S\", \"\", VLOOKUP(A105,Calendar!$A$3:$G$459,7,FALSE)),IF(VLOOKUP(A105,Calendar!$A$3:$G$459,4,FALSE)=\"S\", \"\", VLOOKUP(A105,Calendar!$A$3:$G$459,4,FALSE)))),\"\",IF(Summary!$B$5=3,IF(VLOOKUP(A105,Calendar!$A$3:$G$459,7,FALSE)=\"S\", \"\", VLOOKUP(A105,Calendar!$A$3:$G$459,7,FALSE)),IF(VLOOKUP(A105,Calendar!$A$3:$G$459,4,FALSE)=\"S\", \"\", VLOOKUP(A105,Calendar!$A$3:$G$459,4,FALSE))))","v":"F"},{"$f":"IF(Summary!$B$5=3,IF(C109=\"\",\"\",VLOOKUP(A105,Calendar!$A$3:$G$459,5,FALSE)),IF(C109=\"\",\"\",VLOOKUP(A105,Calendar!$A$3:$G$459,2,FALSE)))","v":"2019-07-19"},null,null,null,null,0,null,null,""]
[724,null,{"$f":"IF(ISNA(IF(Summary!$B$5=3,IF(VLOOKUP(A106,Calendar!$A$3:$G$459,7,FALSE)=\"S\", \"\", VLOOKUP(A106,Calendar!$A$3:$G$459,7,FALSE)),IF(VLOOKUP(A106,Calendar!$A$3:$G$459,4,FALSE)=\"S\", \"\", VLOOKUP(A106,Calendar!$A$3:$G$459,4,FALSE)))),\"\",IF(Summary!$B$5=3,IF(VLOOKUP(A106,Calendar!$A$3:$G$459,7,FALSE)=\"S\", \"\", VLOOKUP(A106,Calendar!$A$3:$G$459,7,FALSE)),IF(VLOOKUP(A106,Calendar!$A$3:$G$459,4,FALSE)=\"S\", \"\", VLOOKUP(A106,Calendar!$A$3:$G$459,4,FALSE))))","v":""},{"$f":"IF(Summary!$B$5=3,IF(C110=\"\",\"\",VLOOKUP(A106,Calendar!$A$3:$G$459,5,FALSE)),IF(C110=\"\",\"\",VLOOKUP(A106,Calendar!$A$3:$G$459,2,FALSE)))","v":""},null,null,null,null,0,null,null,""]
[725,null,{"$f":"IF(ISNA(IF(Summary!$B$5=3,IF(VLOOKUP(A107,Calendar!$A$3:$G$459,7,FALSE)=\"S\", \"\", VLOOKUP(A107,Calendar!$A$3:$G$459,7,FALSE)),IF(VLOOKUP(A107,Calendar!$A$3:$G$459,4,FALSE)=\"S\", \"\", VLOOKUP(A107,Calendar!$A$3:$G$459,4,FALSE)))),\"\",IF(Summary!$B$5=3,IF(VLOOKUP(A107,Calendar!$A$3:$G$459,7,FALSE)=\"S\", \"\", VLOOKUP(A107,Calendar!$A$3:$G$459,7,FALSE)),IF(VLOOKUP(A107,Calendar!$A$3:$G$459,4,FALSE)=\"S\", \"\", VLOOKUP(A107,Calendar!$A$3:$G$459,4,FALSE))))","v":""},{"$f":"IF(Summary!$B$5=3,IF(C111=\"\",\"\",VLOOKUP(A107,Calendar!$A$3:$G$459,5,FALSE)),IF(C111=\"\",\"\",VLOOKUP(A107,Calendar!$A$3:$G$459,2,FALSE)))","v":""},null,null,null,null,0,null,null,""]
[726,null,{"$f":"IF(ISNA(IF(Summary!$B$5=3,IF(VLOOKUP(A108,Calendar!$A$3:$G$459,7,FALSE)=\"S\", \"\", VLOOKUP(A108,Calendar!$A$3:$G$459,7,FALSE)),IF(VLOOKUP(A108,Calendar!$A$3:$G$459,4,FALSE)=\"S\", \"\", VLOOKUP(A108,Calendar!$A$3:$G$459,4,FALSE)))),\"\",IF(Summary!$B$5=3,IF(VLOOKUP(A108,Calendar!$A$3:$G$459,7,FALSE)=\"S\", \"\", VLOOKUP(A108,Calendar!$A$3:$G$459,7,FALSE)),IF(VLOOKUP(A108,Calendar!$A$3:$G$459,4,FALSE)=\"S\", \"\", VLOOKUP(A108,Calendar!$A$3:$G$459,4,FALSE))))","v":"M"},{"$f":"IF(Summary!$B$5=3,IF(C112=\"\",\"\",VLOOKUP(A108,Calendar!$A$3:$G$459,5,FALSE)),IF(C112=\"\",\"\",VLOOKUP(A108,Calendar!$A$3:$G$459,2,FALSE)))","v":"2019-07-22"},null,null,null,null,0,null,null,""]
[727,null,{"$f":"IF(ISNA(IF(Summary!$B$5=3,IF(VLOOKUP(A109,Calendar!$A$3:$G$459,7,FALSE)=\"S\", \"\", VLOOKUP(A109,Calendar!$A$3:$G$459,7,FALSE)),IF(VLOOKUP(A109,Calendar!$A$3:$G$459,4,FALSE)=\"S\", \"\", VLOOKUP(A109,Calendar!$A$3:$G$459,4,FALSE)))),\"\",IF(Summary!$B$5=3,IF(VLOOKUP(A109,Calendar!$A$3:$G$459,7,FALSE)=\"S\", \"\", VLOOKUP(A109,Calendar!$A$3:$G$459,7,FALSE)),IF(VLOOKUP(A109,Calendar!$A$3:$G$459,4,FALSE)=\"S\", \"\", VLOOKUP(A109,Calendar!$A$3:$G$459,4,FALSE))))","v":"T"},{"$f":"IF(Summary!$B$5=3,IF(C113=\"\",\"\",VLOOKUP(A109,Calendar!$A$3:$G$459,5,FALSE)),IF(C113=\"\",\"\",VLOOKUP(A109,Calendar!$A$3:$G$459,2,FALSE)))","v":"2019-07-23"},null,null,null,null,0,null,null,""]
[728,null,{"$f":"IF(ISNA(IF(Summary!$B$5=3,IF(VLOOKUP(A110,Calendar!$A$3:$G$459,7,FALSE)=\"S\", \"\", VLOOKUP(A110,Calendar!$A$3:$G$459,7,FALSE)),IF(VLOOKUP(A110,Calendar!$A$3:$G$459,4,FALSE)=\"S\", \"\", VLOOKUP(A110,Calendar!$A$3:$G$459,4,FALSE)))),\"\",IF(Summary!$B$5=3,IF(VLOOKUP(A110,Calendar!$A$3:$G$459,7,FALSE)=\"S\", \"\", VLOOKUP(A110,Calendar!$A$3:$G$459,7,FALSE)),IF(VLOOKUP(A110,Calendar!$A$3:$G$459,4,FALSE)=\"S\", \"\", VLOOKUP(A110,Calendar!$A$3:$G$459,4,FALSE))))","v":"W"},{"$f":"IF(Summary!$B$5=3,IF(C114=\"\",\"\",VLOOKUP(A110,Calendar!$A$3:$G$459,5,FALSE)),IF(C114=\"\",\"\",VLOOKUP(A110,Calendar!$A$3:$G$459,2,FALSE)))","v":"2019-07-24"},null,null,null,null,0,null,null,""]
[729,null,{"$f":"IF(ISNA(IF(Summary!$B$5=3,IF(VLOOKUP(A111,Calendar!$A$3:$G$459,7,FALSE)=\"S\", \"\", VLOOKUP(A111,Calendar!$A$3:$G$459,7,FALSE)),IF(VLOOKUP(A111,Calendar!$A$3:$G$459,4,FALSE)=\"S\", \"\", VLOOKUP(A111,Calendar!$A$3:$G$459,4,FALSE)))),\"\",IF(Summary!$B$5=3,IF(VLOOKUP(A111,Calendar!$A$3:$G$459,7,FALSE)=\"S\", \"\", VLOOKUP(A111,Calendar!$A$3:$G$459,7,FALSE)),IF(VLOOKUP(A111,Calendar!$A$3:$G$459,4,FALSE)=\"S\", \"\", VLOOKUP(A111,Calendar!$A$3:$G$459,4,FALSE))))","v":"R"},{"$f":"IF(Summary!$B$5=3,IF(C115=\"\",\"\",VLOOKUP(A111,Calendar!$A$3:$G$459,5,FALSE)),IF(C115=\"\",\"\",VLOOKUP(A111,Calendar!$A$3:$G$459,2,FALSE)))","v":"2019-07-25"},null,null,null,null,0,null,null,""]
[730,null,{"$f":"IF(ISNA(IF(Summary!$B$5=3,IF(VLOOKUP(A112,Calendar!$A$3:$G$459,7,FALSE)=\"S\", \"\", VLOOKUP(A112,Calendar!$A$3:$G$459,7,FALSE)),IF(VLOOKUP(A112,Calendar!$A$3:$G$459,4,FALSE)=\"S\", \"\", VLOOKUP(A112,Calendar!$A$3:$G$459,4,FALSE)))),\"\",IF(Summary!$B$5=3,IF(VLOOKUP(A112,Calendar!$A$3:$G$459,7,FALSE)=\"S\", \"\", VLOOKUP(A112,Calendar!$A$3:$G$459,7,FALSE)),IF(VLOOKUP(A112,Calendar!$A$3:$G$459,4,FALSE)=\"S\", \"\", VLOOKUP(A112,Calendar!$A$3:$G$459,4,FALSE))))","v":"F"},{"$f":"IF(Summary!$B$5=3,IF(C116=\"\",\"\",VLOOKUP(A112,Calendar!$A$3:$G$459,5,FALSE)),IF(C116=\"\",\"\",VLOOKUP(A112,Calendar!$A$3:$G$459,2,FALSE)))","v":"2019-07-26"},null,null,null,null,0,null,null,""]
[731,null,{"$f":"IF(ISNA(IF(Summary!$B$5=3,IF(VLOOKUP(A113,Calendar!$A$3:$G$459,7,FALSE)=\"S\", \"\", VLOOKUP(A113,Calendar!$A$3:$G$459,7,FALSE)),IF(VLOOKUP(A113,Calendar!$A$3:$G$459,4,FALSE)=\"S\", \"\", VLOOKUP(A113,Calendar!$A$3:$G$459,4,FALSE)))),\"\",IF(Summary!$B$5=3,IF(VLOOKUP(A113,Calendar!$A$3:$G$459,7,FALSE)=\"S\", \"\", VLOOKUP(A113,Calendar!$A$3:$G$459,7,FALSE)),IF(VLOOKUP(A113,Calendar!$A$3:$G$459,4,FALSE)=\"S\", \"\", VLOOKUP(A113,Calendar!$A$3:$G$459,4,FALSE))))","v":""},{"$f":"IF(Summary!$B$5=3,IF(C117=\"\",\"\",VLOOKUP(A113,Calendar!$A$3:$G$459,5,FALSE)),IF(C117=\"\",\"\",VLOOKUP(A113,Calendar!$A$3:$G$459,2,FALSE)))","v":""},null,null,null,null,0,null,null,""]
[null,null,{"$f":"IF(ISNA(IF(Summary!$B$5=3,IF(VLOOKUP(A114,Calendar!$A$3:$G$459,7,FALSE)=\"S\", \"\", VLOOKUP(A114,Calendar!$A$3:$G$459,7,FALSE)),IF(VLOOKUP(A114,Calendar!$A$3:$G$459,4,FALSE)=\"S\", \"\", VLOOKUP(A114,Calendar!$A$3:$G$459,4,FALSE)))),\"\",IF(Summary!$B$5=3,IF(VLOOKUP(A114,Calendar!$A$3:$G$459,7,FALSE)=\"S\", \"\", VLOOKUP(A114,Calendar!$A$3:$G$459,7,FALSE)),IF(VLOOKUP(A114,Calendar!$A$3:$G$459,4,FALSE)=\"S\", \"\", VLOOKUP(A114,Calendar!$A$3:$G$459,4,FALSE))))","v":""},{"$f":"IF(Summary!$B$5=3,IF(C118=\"\",\"\",VLOOKUP(A114,Calendar!$A$3:$G$459,5,FALSE)),IF(C118=\"\",\"\",VLOOKUP(A114,Calendar!$A$3:$G$459,2,FALSE)))","v":""},null,null,null,null,0,null,null,{"$f":"IF(SUM(E122:H122)>COUNTA(E91:E121)*390,\"The sum total for all cost objectives exceeds the maximum anticipated value based upon the number of days worked. Confirm minutes claimed for each day.\",\"\")","v":""}]
[null,null,{"$f":"IF(ISNA(IF(Summary!$B$5=3,IF(VLOOKUP(A115,Calendar!$A$3:$G$459,7,FALSE)=\"S\", \"\", VLOOKUP(A115,Calendar!$A$3:$G$459,7,FALSE)),IF(VLOOKUP(A115,Calendar!$A$3:$G$459,4,FALSE)=\"S\", \"\", VLOOKUP(A115,Calendar!$A$3:$G$459,4,FALSE)))),\"\",IF(Summary!$B$5=3,IF(VLOOKUP(A115,Calendar!$A$3:$G$459,7,FALSE)=\"S\", \"\", VLOOKUP(A115,Calendar!$A$3:$G$459,7,FALSE)),IF(VLOOKUP(A115,Calendar!$A$3:$G$459,4,FALSE)=\"S\", \"\", VLOOKUP(A115,Calendar!$A$3:$G$459,4,FALSE))))","v":"M"},{"$f":"IF(Summary!$B$5=3,IF(C119=\"\",\"\",VLOOKUP(A115,Calendar!$A$3:$G$459,5,FALSE)),IF(C119=\"\",\"\",VLOOKUP(A115,Calendar!$A$3:$G$459,2,FALSE)))","v":"2019-07-29"},null,null,null,null,0]
[null,null,{"$f":"IF(ISNA(IF(Summary!$B$5=3,IF(VLOOKUP(A116,Calendar!$A$3:$G$459,7,FALSE)=\"S\", \"\", VLOOKUP(A116,Calendar!$A$3:$G$459,7,FALSE)),IF(VLOOKUP(A116,Calendar!$A$3:$G$459,4,FALSE)=\"S\", \"\", VLOOKUP(A116,Calendar!$A$3:$G$459,4,FALSE)))),\"\",IF(Summary!$B$5=3,IF(VLOOKUP(A116,Calendar!$A$3:$G$459,7,FALSE)=\"S\", \"\", VLOOKUP(A116,Calendar!$A$3:$G$459,7,FALSE)),IF(VLOOKUP(A116,Calendar!$A$3:$G$459,4,FALSE)=\"S\", \"\", VLOOKUP(A116,Calendar!$A$3:$G$459,4,FALSE))))","v":"T"},{"$f":"IF(Summary!$B$5=3,IF(C120=\"\",\"\",VLOOKUP(A116,Calendar!$A$3:$G$459,5,FALSE)),IF(C120=\"\",\"\",VLOOKUP(A116,Calendar!$A$3:$G$459,2,FALSE)))","v":"2019-07-30"},null,null,null,null,0]
[null,null,{"$f":"IF(ISNA(IF(Summary!$B$5=3,IF(VLOOKUP(A117,Calendar!$A$3:$G$459,7,FALSE)=\"S\", \"\", VLOOKUP(A117,Calendar!$A$3:$G$459,7,FALSE)),IF(VLOOKUP(A117,Calendar!$A$3:$G$459,4,FALSE)=\"S\", \"\", VLOOKUP(A117,Calendar!$A$3:$G$459,4,FALSE)))),\"\",IF(Summary!$B$5=3,IF(VLOOKUP(A117,Calendar!$A$3:$G$459,7,FALSE)=\"S\", \"\", VLOOKUP(A117,Calendar!$A$3:$G$459,7,FALSE)),IF(VLOOKUP(A117,Calendar!$A$3:$G$459,4,FALSE)=\"S\", \"\", VLOOKUP(A117,Calendar!$A$3:$G$459,4,FALSE))))","v":"W"},{"$f":"IF(Summary!$B$5=3,IF(C121=\"\",\"\",VLOOKUP(A117,Calendar!$A$3:$G$459,5,FALSE)),IF(C121=\"\",\"\",VLOOKUP(A117,Calendar!$A$3:$G$459,2,FALSE)))","v":"2019-07-31"},null,null,null,null,0]
[null,null,null,"Total Minutes",{"$f":"SUM(E91:E121)","v":0},{"$f":"SUM(F91:F121)","v":0},{"$f":"SUM(G91:G121)","v":0},{"$f":"SUM(H91:H121)","v":0},{"$f":"SUM(I91:I121)","v":0}]
[null,null,null,"Total Hours",{"$f":"E122/60","v":0},{"$f":"F122/60","v":0},{"$f":"G122/60","v":0},{"$f":"H122/60","v":0},{"$f":"I122/60","v":0}]
[]
[]
[null,null,"Personnel Activity Report"]
[null,null,"Extended School Year",null,null,null,null,null,null,null,null,{"$f":"IF(OR(AND(F131=\"\",COUNTA(F132:F162)>0),AND(G131=\"\",COUNTA(G132:G162)>0),AND(H131=\"\",COUNTA(H132:H162)>0)),\"<<< You must identify the cost objective in the column heading.\",\"\")","v":""}]
[801,null,"August",null,null,null,null,null,null,null,null,{"$f":"IF(I132>390, \"<<< Day exceeds 390 minutes. Confirm reported time.\",\"\")","v":""}]
[802,null,{"$f":"IF(Summary!$E$8<>\"\",Summary!$E$8,\" \")","v":" "},null,null,null,null,null,null,null,null,{"$f":"IF(I133>390, \"<<< Day exceeds 390 minutes. Confirm reported time.\",\"\")","v":""}]
[803,null,{"$f":"IF(Summary!$E$9<>\"\",Summary!$E$9,\" \")","v":" "},null,null,null,null,null,null,null,null,""]
[804,null,"Day","Date","Special Ed","General Ed","Other","Other","Totals",null,null,""]
[805,null,{"$f":"IF(ISNA(IF(Summary!$B$5=3,IF(VLOOKUP(A128,Calendar!$A$3:$G$459,7,FALSE)=\"S\", \"\", VLOOKUP(A128,Calendar!$A$3:$G$459,7,FALSE)),IF(VLOOKUP(A128,Calendar!$A$3:$G$459,4,FALSE)=\"S\", \"\", VLOOKUP(A128,Calendar!$A$3:$G$459,4,FALSE)))),\"\",IF(Summary!$B$5=3,IF(VLOOKUP(A128,Calendar!$A$3:$G$459,7,FALSE)=\"S\", \"\", VLOOKUP(A128,Calendar!$A$3:$G$459,7,FALSE)),IF(VLOOKUP(A128,Calendar!$A$3:$G$459,4,FALSE)=\"S\", \"\", VLOOKUP(A128,Calendar!$A$3:$G$459,4,FALSE))))","v":"R"},{"$f":"IF(Summary!$B$5=3,IF(C132=\"\",\"\",VLOOKUP(A128,Calendar!$A$3:$G$459,5,FALSE)),IF(C132=\"\",\"\",VLOOKUP(A128,Calendar!$A$3:$G$459,2,FALSE)))","v":"2019-08-01"},null,null,null,null,{"$f":"MIN(1440,SUM(E132:H132))","v":0},null,null,""]
[806,null,{"$f":"IF(ISNA(IF(Summary!$B$5=3,IF(VLOOKUP(A129,Calendar!$A$3:$G$459,7,FALSE)=\"S\", \"\", VLOOKUP(A129,Calendar!$A$3:$G$459,7,FALSE)),IF(VLOOKUP(A129,Calendar!$A$3:$G$459,4,FALSE)=\"S\", \"\", VLOOKUP(A129,Calendar!$A$3:$G$459,4,FALSE)))),\"\",IF(Summary!$B$5=3,IF(VLOOKUP(A129,Calendar!$A$3:$G$459,7,FALSE)=\"S\", \"\", VLOOKUP(A129,Calendar!$A$3:$G$459,7,FALSE)),IF(VLOOKUP(A129,Calendar!$A$3:$G$459,4,FALSE)=\"S\", \"\", VLOOKUP(A129,Calendar!$A$3:$G$459,4,FALSE))))","v":"F"},{"$f":"IF(Summary!$B$5=3,IF(C133=\"\",\"\",VLOOKUP(A129,Calendar!$A$3:$G$459,5,FALSE)),IF(C133=\"\",\"\",VLOOKUP(A129,Calendar!$A$3:$G$459,2,FALSE)))","v":"2019-08-02"},null,null,null,null,{"$f":"MIN(1440,SUM(E133:H133))","v":0},null,null,""]
[807,null,{"$f":"IF(ISNA(IF(Summary!$B$5=3,IF(VLOOKUP(A130,Calendar!$A$3:$G$459,7,FALSE)=\"S\", \"\", VLOOKUP(A130,Calendar!$A$3:$G$459,7,FALSE)),IF(VLOOKUP(A130,Calendar!$A$3:$G$459,4,FALSE)=\"S\", \"\", VLOOKUP(A130,Calendar!$A$3:$G$459,4,FALSE)))),\"\",IF(Summary!$B$5=3,IF(VLOOKUP(A130,Calendar!$A$3:$G$459,7,FALSE)=\"S\", \"\", VLOOKUP(A130,Calendar!$A$3:$G$459,7,FALSE)),IF(VLOOKUP(A130,Calendar!$A$3:$G$459,4,FALSE)=\"S\", \"\", VLOOKUP(A130,Calendar!$A$3:$G$459,4,FALSE))))","v":""},{"$f":"IF(Summary!$B$5=3,IF(C134=\"\",\"\",VLOOKUP(A130,Calendar!$A$3:$G$459,5,FALSE)),IF(C134=\"\",\"\",VLOOKUP(A130,Calendar!$A$3:$G$459,2,FALSE)))","v":""},null,null,null,null,0,null,null,""]
[808,null,{"$f":"IF(ISNA(IF(Summary!$B$5=3,IF(VLOOKUP(A131,Calendar!$A$3:$G$459,7,FALSE)=\"S\", \"\", VLOOKUP(A131,Calendar!$A$3:$G$459,7,FALSE)),IF(VLOOKUP(A131,Calendar!$A$3:$G$459,4,FALSE)=\"S\", \"\", VLOOKUP(A131,Calendar!$A$3:$G$459,4,FALSE)))),\"\",IF(Summary!$B$5=3,IF(VLOOKUP(A131,Calendar!$A$3:$G$459,7,FALSE)=\"S\", \"\", VLOOKUP(A131,Calendar!$A$3:$G$459,7,FALSE)),IF(VLOOKUP(A131,Calendar!$A$3:$G$459,4,FALSE)=\"S\", \"\", VLOOKUP(A131,Calendar!$A$3:$G$459,4,FALSE))))","v":""},{"$f":"IF(Summary!$B$5=3,IF(C135=\"\",\"\",VLOOKUP(A131,Calendar!$A$3:$G$459,5,FALSE)),IF(C135=\"\",\"\",VLOOKUP(A131,Calendar!$A$3:$G$459,2,FALSE)))","v":""},null,null,null,null,0,null,null,""]
[809,null,{"$f":"IF(ISNA(IF(Summary!$B$5=3,IF(VLOOKUP(A132,Calendar!$A$3:$G$459,7,FALSE)=\"S\", \"\", VLOOKUP(A132,Calendar!$A$3:$G$459,7,FALSE)),IF(VLOOKUP(A132,Calendar!$A$3:$G$459,4,FALSE)=\"S\", \"\", VLOOKUP(A132,Calendar!$A$3:$G$459,4,FALSE)))),\"\",IF(Summary!$B$5=3,IF(VLOOKUP(A132,Calendar!$A$3:$G$459,7,FALSE)=\"S\", \"\", VLOOKUP(A132,Calendar!$A$3:$G$459,7,FALSE)),IF(VLOOKUP(A132,Calendar!$A$3:$G$459,4,FALSE)=\"S\", \"\", VLOOKUP(A132,Calendar!$A$3:$G$459,4,FALSE))))","v":"M"},{"$f":"IF(Summary!$B$5=3,IF(C136=\"\",\"\",VLOOKUP(A132,Calendar!$A$3:$G$459,5,FALSE)),IF(C136=\"\",\"\",VLOOKUP(A132,Calendar!$A$3:$G$459,2,FALSE)))","v":"2019-08-05"},null,null,null,null,0,null,null,""]
[810,null,{"$f":"IF(ISNA(IF(Summary!$B$5=3,IF(VLOOKUP(A133,Calendar!$A$3:$G$459,7,FALSE)=\"S\", \"\", VLOOKUP(A133,Calendar!$A$3:$G$459,7,FALSE)),IF(VLOOKUP(A133,Calendar!$A$3:$G$459,4,FALSE)=\"S\", \"\", VLOOKUP(A133,Calendar!$A$3:$G$459,4,FALSE)))),\"\",IF(Summary!$B$5=3,IF(VLOOKUP(A133,Calendar!$A$3:$G$459,7,FALSE)=\"S\", \"\", VLOOKUP(A133,Calendar!$A$3:$G$459,7,FALSE)),IF(VLOOKUP(A133,Calendar!$A$3:$G$459,4,FALSE)=\"S\", \"\", VLOOKUP(A133,Calendar!$A$3:$G$459,4,FALSE))))","v":"T"},{"$f":"IF(Summary!$B$5=3,IF(C137=\"\",\"\",VLOOKUP(A133,Calendar!$A$3:$G$459,5,FALSE)),IF(C137=\"\",\"\",VLOOKUP(A133,Calendar!$A$3:$G$459,2,FALSE)))","v":"2019-08-06"},null,null,null,null,0,null,null,""]
[811,null,{"$f":"IF(ISNA(IF(Summary!$B$5=3,IF(VLOOKUP(A134,Calendar!$A$3:$G$459,7,FALSE)=\"S\", \"\", VLOOKUP(A134,Calendar!$A$3:$G$459,7,FALSE)),IF(VLOOKUP(A134,Calendar!$A$3:$G$459,4,FALSE)=\"S\", \"\", VLOOKUP(A134,Calendar!$A$3:$G$459,4,FALSE)))),\"\",IF(Summary!$B$5=3,IF(VLOOKUP(A134,Calendar!$A$3:$G$459,7,FALSE)=\"S\", \"\", VLOOKUP(A134,Calendar!$A$3:$G$459,7,FALSE)),IF(VLOOKUP(A134,Calendar!$A$3:$G$459,4,FALSE)=\"S\", \"\", VLOOKUP(A134,Calendar!$A$3:$G$459,4,FALSE))))","v":"W"},{"$f":"IF(Summary!$B$5=3,IF(C138=\"\",\"\",VLOOKUP(A134,Calendar!$A$3:$G$459,5,FALSE)),IF(C138=\"\",\"\",VLOOKUP(A134,Calendar!$A$3:$G$459,2,FALSE)))","v":"2019-08-07"},null,null,null,null,0,null,null,""]
[812,null,{"$f":"IF(ISNA(IF(Summary!$B$5=3,IF(VLOOKUP(A135,Calendar!$A$3:$G$459,7,FALSE)=\"S\", \"\", VLOOKUP(A135,Calendar!$A$3:$G$459,7,FALSE)),IF(VLOOKUP(A135,Calendar!$A$3:$G$459,4,FALSE)=\"S\", \"\", VLOOKUP(A135,Calendar!$A$3:$G$459,4,FALSE)))),\"\",IF(Summary!$B$5=3,IF(VLOOKUP(A135,Calendar!$A$3:$G$459,7,FALSE)=\"S\", \"\", VLOOKUP(A135,Calendar!$A$3:$G$459,7,FALSE)),IF(VLOOKUP(A135,Calendar!$A$3:$G$459,4,FALSE)=\"S\", \"\", VLOOKUP(A135,Calendar!$A$3:$G$459,4,FALSE))))","v":"R"},{"$f":"IF(Summary!$B$5=3,IF(C139=\"\",\"\",VLOOKUP(A135,Calendar!$A$3:$G$459,5,FALSE)),IF(C139=\"\",\"\",VLOOKUP(A135,Calendar!$A$3:$G$459,2,FALSE)))","v":"2019-08-08"},null,null,null,null,0,null,null,""]
[813,null,{"$f":"IF(ISNA(IF(Summary!$B$5=3,IF(VLOOKUP(A136,Calendar!$A$3:$G$459,7,FALSE)=\"S\", \"\", VLOOKUP(A136,Calendar!$A$3:$G$459,7,FALSE)),IF(VLOOKUP(A136,Calendar!$A$3:$G$459,4,FALSE)=\"S\", \"\", VLOOKUP(A136,Calendar!$A$3:$G$459,4,FALSE)))),\"\",IF(Summary!$B$5=3,IF(VLOOKUP(A136,Calendar!$A$3:$G$459,7,FALSE)=\"S\", \"\", VLOOKUP(A136,Calendar!$A$3:$G$459,7,FALSE)),IF(VLOOKUP(A136,Calendar!$A$3:$G$459,4,FALSE)=\"S\", \"\", VLOOKUP(A136,Calendar!$A$3:$G$459,4,FALSE))))","v":"F"},{"$f":"IF(Summary!$B$5=3,IF(C140=\"\",\"\",VLOOKUP(A136,Calendar!$A$3:$G$459,5,FALSE)),IF(C140=\"\",\"\",VLOOKUP(A136,Calendar!$A$3:$G$459,2,FALSE)))","v":"2019-08-09"},null,null,null,null,0,null,null,""]
[814,null,{"$f":"IF(ISNA(IF(Summary!$B$5=3,IF(VLOOKUP(A137,Calendar!$A$3:$G$459,7,FALSE)=\"S\", \"\", VLOOKUP(A137,Calendar!$A$3:$G$459,7,FALSE)),IF(VLOOKUP(A137,Calendar!$A$3:$G$459,4,FALSE)=\"S\", \"\", VLOOKUP(A137,Calendar!$A$3:$G$459,4,FALSE)))),\"\",IF(Summary!$B$5=3,IF(VLOOKUP(A137,Calendar!$A$3:$G$459,7,FALSE)=\"S\", \"\", VLOOKUP(A137,Calendar!$A$3:$G$459,7,FALSE)),IF(VLOOKUP(A137,Calendar!$A$3:$G$459,4,FALSE)=\"S\", \"\", VLOOKUP(A137,Calendar!$A$3:$G$459,4,FALSE))))","v":""},{"$f":"IF(Summary!$B$5=3,IF(C141=\"\",\"\",VLOOKUP(A137,Calendar!$A$3:$G$459,5,FALSE)),IF(C141=\"\",\"\",VLOOKUP(A137,Calendar!$A$3:$G$459,2,FALSE)))","v":""},null,null,null,null,0,null,null,""]
[815,null,{"$f":"IF(ISNA(IF(Summary!$B$5=3,IF(VLOOKUP(A138,Calendar!$A$3:$G$459,7,FALSE)=\"S\", \"\", VLOOKUP(A138,Calendar!$A$3:$G$459,7,FALSE)),IF(VLOOKUP(A138,Calendar!$A$3:$G$459,4,FALSE)=\"S\", \"\", VLOOKUP(A138,Calendar!$A$3:$G$459,4,FALSE)))),\"\",IF(Summary!$B$5=3,IF(VLOOKUP(A138,Calendar!$A$3:$G$459,7,FALSE)=\"S\", \"\", VLOOKUP(A138,Calendar!$A$3:$G$459,7,FALSE)),IF(VLOOKUP(A138,Calendar!$A$3:$G$459,4,FALSE)=\"S\", \"\", VLOOKUP(A138,Calendar!$A$3:$G$459,4,FALSE))))","v":""},{"$f":"IF(Summary!$B$5=3,IF(C142=\"\",\"\",VLOOKUP(A138,Calendar!$A$3:$G$459,5,FALSE)),IF(C142=\"\",\"\",VLOOKUP(A138,Calendar!$A$3:$G$459,2,FALSE)))","v":""},null,null,null,null,0,null,null,""]
[816,null,{"$f":"IF(ISNA(IF(Summary!$B$5=3,IF(VLOOKUP(A139,Calendar!$A$3:$G$459,7,FALSE)=\"S\", \"\", VLOOKUP(A139,Calendar!$A$3:$G$459,7,FALSE)),IF(VLOOKUP(A139,Calendar!$A$3:$G$459,4,FALSE)=\"S\", \"\", VLOOKUP(A139,Calendar!$A$3:$G$459,4,FALSE)))),\"\",IF(Summary!$B$5=3,IF(VLOOKUP(A139,Calendar!$A$3:$G$459,7,FALSE)=\"S\", \"\", VLOOKUP(A139,Calendar!$A$3:$G$459,7,FALSE)),IF(VLOOKUP(A139,Calendar!$A$3:$G$459,4,FALSE)=\"S\", \"\", VLOOKUP(A139,Calendar!$A$3:$G$459,4,FALSE))))","v":"M"},{"$f":"IF(Summary!$B$5=3,IF(C143=\"\",\"\",VLOOKUP(A139,Calendar!$A$3:$G$459,5,FALSE)),IF(C143=\"\",\"\",VLOOKUP(A139,Calendar!$A$3:$G$459,2,FALSE)))","v":"2019-08-12"},null,null,null,null,0,null,null,""]
[817,null,{"$f":"IF(ISNA(IF(Summary!$B$5=3,IF(VLOOKUP(A140,Calendar!$A$3:$G$459,7,FALSE)=\"S\", \"\", VLOOKUP(A140,Calendar!$A$3:$G$459,7,FALSE)),IF(VLOOKUP(A140,Calendar!$A$3:$G$459,4,FALSE)=\"S\", \"\", VLOOKUP(A140,Calendar!$A$3:$G$459,4,FALSE)))),\"\",IF(Summary!$B$5=3,IF(VLOOKUP(A140,Calendar!$A$3:$G$459,7,FALSE)=\"S\", \"\", VLOOKUP(A140,Calendar!$A$3:$G$459,7,FALSE)),IF(VLOOKUP(A140,Calendar!$A$3:$G$459,4,FALSE)=\"S\", \"\", VLOOKUP(A140,Calendar!$A$3:$G$459,4,FALSE))))","v":"T"},{"$f":"IF(Summary!$B$5=3,IF(C144=\"\",\"\",VLOOKUP(A140,Calendar!$A$3:$G$459,5,FALSE)),IF(C144=\"\",\"\",VLOOKUP(A140,Calendar!$A$3:$G$459,2,FALSE)))","v":"2019-08-13"},null,null,null,null,0,null,null,""]
[818,null,{"$f":"IF(ISNA(IF(Summary!$B$5=3,IF(VLOOKUP(A141,Calendar!$A$3:$G$459,7,FALSE)=\"S\", \"\", VLOOKUP(A141,Calendar!$A$3:$G$459,7,FALSE)),IF(VLOOKUP(A141,Calendar!$A$3:$G$459,4,FALSE)=\"S\", \"\", VLOOKUP(A141,Calendar!$A$3:$G$459,4,FALSE)))),\"\",IF(Summary!$B$5=3,IF(VLOOKUP(A141,Calendar!$A$3:$G$459,7,FALSE)=\"S\", \"\", VLOOKUP(A141,Calendar!$A$3:$G$459,7,FALSE)),IF(VLOOKUP(A141,Calendar!$A$3:$G$459,4,FALSE)=\"S\", \"\", VLOOKUP(A141,Calendar!$A$3:$G$459,4,FALSE))))","v":"W"},{"$f":"IF(Summary!$B$5=3,IF(C145=\"\",\"\",VLOOKUP(A141,Calendar!$A$3:$G$459,5,FALSE)),IF(C145=\"\",\"\",VLOOKUP(A141,Calendar!$A$3:$G$459,2,FALSE)))","v":"2019-08-14"},null,null,null,null,0,null,null,""]
[819,null,{"$f":"IF(ISNA(IF(Summary!$B$5=3,IF(VLOOKUP(A142,Calendar!$A$3:$G$459,7,FALSE)=\"S\", \"\", VLOOKUP(A142,Calendar!$A$3:$G$459,7,FALSE)),IF(VLOOKUP(A142,Calendar!$A$3:$G$459,4,FALSE)=\"S\", \"\", VLOOKUP(A142,Calendar!$A$3:$G$459,4,FALSE)))),\"\",IF(Summary!$B$5=3,IF(VLOOKUP(A142,Calendar!$A$3:$G$459,7,FALSE)=\"S\", \"\", VLOOKUP(A142,Calendar!$A$3:$G$459,7,FALSE)),IF(VLOOKUP(A142,Calendar!$A$3:$G$459,4,FALSE)=\"S\", \"\", VLOOKUP(A142,Calendar!$A$3:$G$459,4,FALSE))))","v":"R"},{"$f":"IF(Summary!$B$5=3,IF(C146=\"\",\"\",VLOOKUP(A142,Calendar!$A$3:$G$459,5,FALSE)),IF(C146=\"\",\"\",VLOOKUP(A142,Calendar!$A$3:$G$459,2,FALSE)))","v":"2019-08-15"},null,null,null,null,0,null,null,""]
[820,null,{"$f":"IF(ISNA(IF(Summary!$B$5=3,IF(VLOOKUP(A143,Calendar!$A$3:$G$459,7,FALSE)=\"S\", \"\", VLOOKUP(A143,Calendar!$A$3:$G$459,7,FALSE)),IF(VLOOKUP(A143,Calendar!$A$3:$G$459,4,FALSE)=\"S\", \"\", VLOOKUP(A143,Calendar!$A$3:$G$459,4,FALSE)))),\"\",IF(Summary!$B$5=3,IF(VLOOKUP(A143,Calendar!$A$3:$G$459,7,FALSE)=\"S\", \"\", VLOOKUP(A143,Calendar!$A$3:$G$459,7,FALSE)),IF(VLOOKUP(A143,Calendar!$A$3:$G$459,4,FALSE)=\"S\", \"\", VLOOKUP(A143,Calendar!$A$3:$G$459,4,FALSE))))","v":"F"},{"$f":"IF(Summary!$B$5=3,IF(C147=\"\",\"\",VLOOKUP(A143,Calendar!$A$3:$G$459,5,FALSE)),IF(C147=\"\",\"\",VLOOKUP(A143,Calendar!$A$3:$G$459,2,FALSE)))","v":"2019-08-16"},null,null,null,null,0,null,null,""]
[821,null,{"$f":"IF(ISNA(IF(Summary!$B$5=3,IF(VLOOKUP(A144,Calendar!$A$3:$G$459,7,FALSE)=\"S\", \"\", VLOOKUP(A144,Calendar!$A$3:$G$459,7,FALSE)),IF(VLOOKUP(A144,Calendar!$A$3:$G$459,4,FALSE)=\"S\", \"\", VLOOKUP(A144,Calendar!$A$3:$G$459,4,FALSE)))),\"\",IF(Summary!$B$5=3,IF(VLOOKUP(A144,Calendar!$A$3:$G$459,7,FALSE)=\"S\", \"\", VLOOKUP(A144,Calendar!$A$3:$G$459,7,FALSE)),IF(VLOOKUP(A144,Calendar!$A$3:$G$459,4,FALSE)=\"S\", \"\", VLOOKUP(A144,Calendar!$A$3:$G$459,4,FALSE))))","v":""},{"$f":"IF(Summary!$B$5=3,IF(C148=\"\",\"\",VLOOKUP(A144,Calendar!$A$3:$G$459,5,FALSE)),IF(C148=\"\",\"\",VLOOKUP(A144,Calendar!$A$3:$G$459,2,FALSE)))","v":""},null,null,null,null,0,null,null,""]
[822,null,{"$f":"IF(ISNA(IF(Summary!$B$5=3,IF(VLOOKUP(A145,Calendar!$A$3:$G$459,7,FALSE)=\"S\", \"\", VLOOKUP(A145,Calendar!$A$3:$G$459,7,FALSE)),IF(VLOOKUP(A145,Calendar!$A$3:$G$459,4,FALSE)=\"S\", \"\", VLOOKUP(A145,Calendar!$A$3:$G$459,4,FALSE)))),\"\",IF(Summary!$B$5=3,IF(VLOOKUP(A145,Calendar!$A$3:$G$459,7,FALSE)=\"S\", \"\", VLOOKUP(A145,Calendar!$A$3:$G$459,7,FALSE)),IF(VLOOKUP(A145,Calendar!$A$3:$G$459,4,FALSE)=\"S\", \"\", VLOOKUP(A145,Calendar!$A$3:$G$459,4,FALSE))))","v":""},{"$f":"IF(Summary!$B$5=3,IF(C149=\"\",\"\",VLOOKUP(A145,Calendar!$A$3:$G$459,5,FALSE)),IF(C149=\"\",\"\",VLOOKUP(A145,Calendar!$A$3:$G$459,2,FALSE)))","v":""},null,null,null,null,0,null,null,""]
[823,null,{"$f":"IF(ISNA(IF(Summary!$B$5=3,IF(VLOOKUP(A146,Calendar!$A$3:$G$459,7,FALSE)=\"S\", \"\", VLOOKUP(A146,Calendar!$A$3:$G$459,7,FALSE)),IF(VLOOKUP(A146,Calendar!$A$3:$G$459,4,FALSE)=\"S\", \"\", VLOOKUP(A146,Calendar!$A$3:$G$459,4,FALSE)))),\"\",IF(Summary!$B$5=3,IF(VLOOKUP(A146,Calendar!$A$3:$G$459,7,FALSE)=\"S\", \"\", VLOOKUP(A146,Calendar!$A$3:$G$459,7,FALSE)),IF(VLOOKUP(A146,Calendar!$A$3:$G$459,4,FALSE)=\"S\", \"\", VLOOKUP(A146,Calendar!$A$3:$G$459,4,FALSE))))","v":"M"},{"$f":"IF(Summary!$B$5=3,IF(C150=\"\",\"\",VLOOKUP(A146,Calendar!$A$3:$G$459,5,FALSE)),IF(C150=\"\",\"\",VLOOKUP(A146,Calendar!$A$3:$G$459,2,FALSE)))","v":"2019-08-19"},null,null,null,null,0,null,null,""]
[824,null,{"$f":"IF(ISNA(IF(Summary!$B$5=3,IF(VLOOKUP(A147,Calendar!$A$3:$G$459,7,FALSE)=\"S\", \"\", VLOOKUP(A147,Calendar!$A$3:$G$459,7,FALSE)),IF(VLOOKUP(A147,Calendar!$A$3:$G$459,4,FALSE)=\"S\", \"\", VLOOKUP(A147,Calendar!$A$3:$G$459,4,FALSE)))),\"\",IF(Summary!$B$5=3,IF(VLOOKUP(A147,Calendar!$A$3:$G$459,7,FALSE)=\"S\", \"\", VLOOKUP(A147,Calendar!$A$3:$G$459,7,FALSE)),IF(VLOOKUP(A147,Calendar!$A$3:$G$459,4,FALSE)=\"S\", \"\", VLOOKUP(A147,Calendar!$A$3:$G$459,4,FALSE))))","v":"T"},{"$f":"IF(Summary!$B$5=3,IF(C151=\"\",\"\",VLOOKUP(A147,Calendar!$A$3:$G$459,5,FALSE)),IF(C151=\"\",\"\",VLOOKUP(A147,Calendar!$A$3:$G$459,2,FALSE)))","v":"2019-08-20"},null,null,null,null,0,null,null,""]
[825,null,{"$f":"IF(ISNA(IF(Summary!$B$5=3,IF(VLOOKUP(A148,Calendar!$A$3:$G$459,7,FALSE)=\"S\", \"\", VLOOKUP(A148,Calendar!$A$3:$G$459,7,FALSE)),IF(VLOOKUP(A148,Calendar!$A$3:$G$459,4,FALSE)=\"S\", \"\", VLOOKUP(A148,Calendar!$A$3:$G$459,4,FALSE)))),\"\",IF(Summary!$B$5=3,IF(VLOOKUP(A148,Calendar!$A$3:$G$459,7,FALSE)=\"S\", \"\", VLOOKUP(A148,Calendar!$A$3:$G$459,7,FALSE)),IF(VLOOKUP(A148,Calendar!$A$3:$G$459,4,FALSE)=\"S\", \"\", VLOOKUP(A148,Calendar!$A$3:$G$459,4,FALSE))))","v":"W"},{"$f":"IF(Summary!$B$5=3,IF(C152=\"\",\"\",VLOOKUP(A148,Calendar!$A$3:$G$459,5,FALSE)),IF(C152=\"\",\"\",VLOOKUP(A148,Calendar!$A$3:$G$459,2,FALSE)))","v":"2019-08-21"},null,null,null,null,0,null,null,""]
[826,null,{"$f":"IF(ISNA(IF(Summary!$B$5=3,IF(VLOOKUP(A149,Calendar!$A$3:$G$459,7,FALSE)=\"S\", \"\", VLOOKUP(A149,Calendar!$A$3:$G$459,7,FALSE)),IF(VLOOKUP(A149,Calendar!$A$3:$G$459,4,FALSE)=\"S\", \"\", VLOOKUP(A149,Calendar!$A$3:$G$459,4,FALSE)))),\"\",IF(Summary!$B$5=3,IF(VLOOKUP(A149,Calendar!$A$3:$G$459,7,FALSE)=\"S\", \"\", VLOOKUP(A149,Calendar!$A$3:$G$459,7,FALSE)),IF(VLOOKUP(A149,Calendar!$A$3:$G$459,4,FALSE)=\"S\", \"\", VLOOKUP(A149,Calendar!$A$3:$G$459,4,FALSE))))","v":"R"},{"$f":"IF(Summary!$B$5=3,IF(C153=\"\",\"\",VLOOKUP(A149,Calendar!$A$3:$G$459,5,FALSE)),IF(C153=\"\",\"\",VLOOKUP(A149,Calendar!$A$3:$G$459,2,FALSE)))","v":"2019-08-22"},null,null,null,null,0,null,null,""]
[827,null,{"$f":"IF(ISNA(IF(Summary!$B$5=3,IF(VLOOKUP(A150,Calendar!$A$3:$G$459,7,FALSE)=\"S\", \"\", VLOOKUP(A150,Calendar!$A$3:$G$459,7,FALSE)),IF(VLOOKUP(A150,Calendar!$A$3:$G$459,4,FALSE)=\"S\", \"\", VLOOKUP(A150,Calendar!$A$3:$G$459,4,FALSE)))),\"\",IF(Summary!$B$5=3,IF(VLOOKUP(A150,Calendar!$A$3:$G$459,7,FALSE)=\"S\", \"\", VLOOKUP(A150,Calendar!$A$3:$G$459,7,FALSE)),IF(VLOOKUP(A150,Calendar!$A$3:$G$459,4,FALSE)=\"S\", \"\", VLOOKUP(A150,Calendar!$A$3:$G$459,4,FALSE))))","v":"F"},{"$f":"IF(Summary!$B$5=3,IF(C154=\"\",\"\",VLOOKUP(A150,Calendar!$A$3:$G$459,5,FALSE)),IF(C154=\"\",\"\",VLOOKUP(A150,Calendar!$A$3:$G$459,2,FALSE)))","v":"2019-08-23"},null,null,null,null,0,null,null,""]
[828,null,{"$f":"IF(ISNA(IF(Summary!$B$5=3,IF(VLOOKUP(A151,Calendar!$A$3:$G$459,7,FALSE)=\"S\", \"\", VLOOKUP(A151,Calendar!$A$3:$G$459,7,FALSE)),IF(VLOOKUP(A151,Calendar!$A$3:$G$459,4,FALSE)=\"S\", \"\", VLOOKUP(A151,Calendar!$A$3:$G$459,4,FALSE)))),\"\",IF(Summary!$B$5=3,IF(VLOOKUP(A151,Calendar!$A$3:$G$459,7,FALSE)=\"S\", \"\", VLOOKUP(A151,Calendar!$A$3:$G$459,7,FALSE)),IF(VLOOKUP(A151,Calendar!$A$3:$G$459,4,FALSE)=\"S\", \"\", VLOOKUP(A151,Calendar!$A$3:$G$459,4,FALSE))))","v":""},{"$f":"IF(Summary!$B$5=3,IF(C155=\"\",\"\",VLOOKUP(A151,Calendar!$A$3:$G$459,5,FALSE)),IF(C155=\"\",\"\",VLOOKUP(A151,Calendar!$A$3:$G$459,2,FALSE)))","v":""},null,null,null,null,0,null,null,""]
[829,null,{"$f":"IF(ISNA(IF(Summary!$B$5=3,IF(VLOOKUP(A152,Calendar!$A$3:$G$459,7,FALSE)=\"S\", \"\", VLOOKUP(A152,Calendar!$A$3:$G$459,7,FALSE)),IF(VLOOKUP(A152,Calendar!$A$3:$G$459,4,FALSE)=\"S\", \"\", VLOOKUP(A152,Calendar!$A$3:$G$459,4,FALSE)))),\"\",IF(Summary!$B$5=3,IF(VLOOKUP(A152,Calendar!$A$3:$G$459,7,FALSE)=\"S\", \"\", VLOOKUP(A152,Calendar!$A$3:$G$459,7,FALSE)),IF(VLOOKUP(A152,Calendar!$A$3:$G$459,4,FALSE)=\"S\", \"\", VLOOKUP(A152,Calendar!$A$3:$G$459,4,FALSE))))","v":""},{"$f":"IF(Summary!$B$5=3,IF(C156=\"\",\"\",VLOOKUP(A152,Calendar!$A$3:$G$459,5,FALSE)),IF(C156=\"\",\"\",VLOOKUP(A152,Calendar!$A$3:$G$459,2,FALSE)))","v":""},null,null,null,null,0,null,null,""]
[830,null,{"$f":"IF(ISNA(IF(Summary!$B$5=3,IF(VLOOKUP(A153,Calendar!$A$3:$G$459,7,FALSE)=\"S\", \"\", VLOOKUP(A153,Calendar!$A$3:$G$459,7,FALSE)),IF(VLOOKUP(A153,Calendar!$A$3:$G$459,4,FALSE)=\"S\", \"\", VLOOKUP(A153,Calendar!$A$3:$G$459,4,FALSE)))),\"\",IF(Summary!$B$5=3,IF(VLOOKUP(A153,Calendar!$A$3:$G$459,7,FALSE)=\"S\", \"\", VLOOKUP(A153,Calendar!$A$3:$G$459,7,FALSE)),IF(VLOOKUP(A153,Calendar!$A$3:$G$459,4,FALSE)=\"S\", \"\", VLOOKUP(A153,Calendar!$A$3:$G$459,4,FALSE))))","v":"M"},{"$f":"IF(Summary!$B$5=3,IF(C157=\"\",\"\",VLOOKUP(A153,Calendar!$A$3:$G$459,5,FALSE)),IF(C157=\"\",\"\",VLOOKUP(A153,Calendar!$A$3:$G$459,2,FALSE)))","v":"2019-08-26"},null,null,null,null,0,null,null,""]
[831,null,{"$f":"IF(ISNA(IF(Summary!$B$5=3,IF(VLOOKUP(A154,Calendar!$A$3:$G$459,7,FALSE)=\"S\", \"\", VLOOKUP(A154,Calendar!$A$3:$G$459,7,FALSE)),IF(VLOOKUP(A154,Calendar!$A$3:$G$459,4,FALSE)=\"S\", \"\", VLOOKUP(A154,Calendar!$A$3:$G$459,4,FALSE)))),\"\",IF(Summary!$B$5=3,IF(VLOOKUP(A154,Calendar!$A$3:$G$459,7,FALSE)=\"S\", \"\", VLOOKUP(A154,Calendar!$A$3:$G$459,7,FALSE)),IF(VLOOKUP(A154,Calendar!$A$3:$G$459,4,FALSE)=\"S\", \"\", VLOOKUP(A154,Calendar!$A$3:$G$459,4,FALSE))))","v":"T"},{"$f":"IF(Summary!$B$5=3,IF(C158=\"\",\"\",VLOOKUP(A154,Calendar!$A$3:$G$459,5,FALSE)),IF(C158=\"\",\"\",VLOOKUP(A154,Calendar!$A$3:$G$459,2,FALSE)))","v":"2019-08-27"},null,null,null,null,0,null,null,""]
[null,null,{"$f":"IF(ISNA(IF(Summary!$B$5=3,IF(VLOOKUP(A155,Calendar!$A$3:$G$459,7,FALSE)=\"S\", \"\", VLOOKUP(A155,Calendar!$A$3:$G$459,7,FALSE)),IF(VLOOKUP(A155,Calendar!$A$3:$G$459,4,FALSE)=\"S\", \"\", VLOOKUP(A155,Calendar!$A$3:$G$459,4,FALSE)))),\"\",IF(Summary!$B$5=3,IF(VLOOKUP(A155,Calendar!$A$3:$G$459,7,FALSE)=\"S\", \"\", VLOOKUP(A155,Calendar!$A$3:$G$459,7,FALSE)),IF(VLOOKUP(A155,Calendar!$A$3:$G$459,4,FALSE)=\"S\", \"\", VLOOKUP(A155,Calendar!$A$3:$G$459,4,FALSE))))","v":"W"},{"$f":"IF(Summary!$B$5=3,IF(C159=\"\",\"\",VLOOKUP(A155,Calendar!$A$3:$G$459,5,FALSE)),IF(C159=\"\",\"\",VLOOKUP(A155,Calendar!$A$3:$G$459,2,FALSE)))","v":"2019-08-28"},null,null,null,null,0,null,null,{"$f":"IF(SUM(E163:H163)>COUNTA(E132:E162)*390,\"The sum total for all cost objectives exceeds the maximum anticipated value based upon the number of days worked. Confirm minutes claimed for each day.\",\"\")","v":""}]
[null,null,{"$f":"IF(ISNA(IF(Summary!$B$5=3,IF(VLOOKUP(A156,Calendar!$A$3:$G$459,7,FALSE)=\"S\", \"\", VLOOKUP(A156,Calendar!$A$3:$G$459,7,FALSE)),IF(VLOOKUP(A156,Calendar!$A$3:$G$459,4,FALSE)=\"S\", \"\", VLOOKUP(A156,Calendar!$A$3:$G$459,4,FALSE)))),\"\",IF(Summary!$B$5=3,IF(VLOOKUP(A156,Calendar!$A$3:$G$459,7,FALSE)=\"S\", \"\", VLOOKUP(A156,Calendar!$A$3:$G$459,7,FALSE)),IF(VLOOKUP(A156,Calendar!$A$3:$G$459,4,FALSE)=\"S\", \"\", VLOOKUP(A156,Calendar!$A$3:$G$459,4,FALSE))))","v":"R"},{"$f":"IF(Summary!$B$5=3,IF(C160=\"\",\"\",VLOOKUP(A156,Calendar!$A$3:$G$459,5,FALSE)),IF(C160=\"\",\"\",VLOOKUP(A156,Calendar!$A$3:$G$459,2,FALSE)))","v":"2019-08-29"},null,null,null,null,0]
[null,null,{"$f":"IF(ISNA(IF(Summary!$B$5=3,IF(VLOOKUP(A157,Calendar!$A$3:$G$459,7,FALSE)=\"S\", \"\", VLOOKUP(A157,Calendar!$A$3:$G$459,7,FALSE)),IF(VLOOKUP(A157,Calendar!$A$3:$G$459,4,FALSE)=\"S\", \"\", VLOOKUP(A157,Calendar!$A$3:$G$459,4,FALSE)))),\"\",IF(Summary!$B$5=3,IF(VLOOKUP(A157,Calendar!$A$3:$G$459,7,FALSE)=\"S\", \"\", VLOOKUP(A157,Calendar!$A$3:$G$459,7,FALSE)),IF(VLOOKUP(A157,Calendar!$A$3:$G$459,4,FALSE)=\"S\", \"\", VLOOKUP(A157,Calendar!$A$3:$G$459,4,FALSE))))","v":"F"},{"$f":"IF(Summary!$B$5=3,IF(C161=\"\",\"\",VLOOKUP(A157,Calendar!$A$3:$G$459,5,FALSE)),IF(C161=\"\",\"\",VLOOKUP(A157,Calendar!$A$3:$G$459,2,FALSE)))","v":"2019-08-30"},null,null,null,null,0]
[null,null,{"$f":"IF(ISNA(IF(Summary!$B$5=3,IF(VLOOKUP(A158,Calendar!$A$3:$G$459,7,FALSE)=\"S\", \"\", VLOOKUP(A158,Calendar!$A$3:$G$459,7,FALSE)),IF(VLOOKUP(A158,Calendar!$A$3:$G$459,4,FALSE)=\"S\", \"\", VLOOKUP(A158,Calendar!$A$3:$G$459,4,FALSE)))),\"\",IF(Summary!$B$5=3,IF(VLOOKUP(A158,Calendar!$A$3:$G$459,7,FALSE)=\"S\", \"\", VLOOKUP(A158,Calendar!$A$3:$G$459,7,FALSE)),IF(VLOOKUP(A158,Calendar!$A$3:$G$459,4,FALSE)=\"S\", \"\", VLOOKUP(A158,Calendar!$A$3:$G$459,4,FALSE))))","v":""},{"$f":"IF(Summary!$B$5=3,IF(C162=\"\",\"\",VLOOKUP(A158,Calendar!$A$3:$G$459,5,FALSE)),IF(C162=\"\",\"\",VLOOKUP(A158,Calendar!$A$3:$G$459,2,FALSE)))","v":""},null,null,null,null,0]
[null,null,null,"Total Minutes",{"$f":"SUM(E132:E162)","v":0},{"$f":"SUM(F132:F162)","v":0},{"$f":"SUM(G132:G162)","v":0},{"$f":"SUM(H132:H162)","v":0},{"$f":"SUM(I132:I162)","v":0}]
[null,null,null,"Total Hours",{"$f":"E163/60","v":0},{"$f":"F163/60","v":0},{"$f":"G163/60","v":0},{"$f":"H163/60","v":0},{"$f":"I163/60","v":0}]
[]
[]
[null,null,"Notes"]
[]
[]
[]
[]
[]
[]
[]
[]
[]
[null,null,null,null,"Kansas State Department of Education",null,null,null,"Personnel Activity Report"]
[null,null,null,null,"Fiscal Auditing",null,null,null,"Updated 9/20/18"]
[null,null,null,null,"785-296-4976"]
[null,null,null,null,"https://www.ksde.org/Agency/Fiscal-and-Administrative-Services/Fiscal-Auditing"]
[]
[]
[null,null,"The Kansas State Department of Education does not discriminate on the basis of race, color, national origin, sex, disability, or age in its programs and activities and provides equal access to the Boy Scouts and other designated youth groups. The following person has been designated to handle inquiries regarding the nondiscrimination policies: KSDE General Counsel, Office of General Counsel, KSDE, Landon State Office Building, 900 S.W. Jackson, Suite 102, Topeka, KS 66612, (785) 296-3204."]

{"sheet":"August","index":3,"n_rows":61,"n_cols":9,"rows_kept":61,"cut":false,"hidden":false,"merged":[[60,2,62,8],[2,2,2,8],[3,2,3,8],[4,2,4,8],[5,2,5,8],[47,2,47,8],[48,2,48,8],[49,2,49,8],[6,2,6,8],[43,3,43,8],[44,2,44,8],[45,2,45,8],[46,2,46,8]]}
[]
[]
[null,null,"Personnel Activity Report"]
[null,null,"Regular School Year"]
[null,null,"August"]
[null,null,{"$f":"IF(Summary!$E$8<>\"\",Summary!$E$8,\" \")","v":" "}]
[null,null,{"$f":"IF(Summary!$E$9<>\"\",Summary!$E$9,\" \")","v":" "}]
[null,null,"Day","Date","Special Ed","General Ed","Other","Other","Totals"]
[801,null,{"$f":"IF(ISNA(IF(Summary!$B$5=3,IF(VLOOKUP(A9,Calendar!$A$3:$G$459,7,FALSE)=\"S\", \"\", VLOOKUP(A9,Calendar!$A$3:$G$459,7,FALSE)),IF(VLOOKUP(A9,Calendar!$A$3:$G$459,4,FALSE)=\"S\", \"\", VLOOKUP(A9,Calendar!$A$3:$G$459,4,FALSE)))),\"\",IF(Summary!$B$5=3,IF(VLOOKUP(A9,Calendar!$A$3:$G$459,7,FALSE)=\"S\", \"\", VLOOKUP(A9,Calendar!$A$3:$G$459,7,FALSE)),IF(VLOOKUP(A9,Calendar!$A$3:$G$459,4,FALSE)=\"S\", \"\", VLOOKUP(A9,Calendar!$A$3:$G$459,4,FALSE))))","v":"R"},{"$f":"IF(Summary!$B$5=3,IF(C9=\"\",\"\",VLOOKUP(A9,Calendar!$A$3:$G$459,5,FALSE)),IF(C9=\"\",\"\",VLOOKUP(A9,Calendar!$A$3:$G$459,2,FALSE)))","v":"2019-08-01"},null,null,null,null,{"$f":"MIN(1440,SUM(E9:H9))","v":0}]
[802,null,{"$f":"IF(ISNA(IF(Summary!$B$5=3,IF(VLOOKUP(A10,Calendar!$A$3:$G$459,7,FALSE)=\"S\", \"\", VLOOKUP(A10,Calendar!$A$3:$G$459,7,FALSE)),IF(VLOOKUP(A10,Calendar!$A$3:$G$459,4,FALSE)=\"S\", \"\", VLOOKUP(A10,Calendar!$A$3:$G$459,4,FALSE)))),\"\",IF(Summary!$B$5=3,IF(VLOOKUP(A10,Calendar!$A$3:$G$459,7,FALSE)=\"S\", \"\", VLOOKUP(A10,Calendar!$A$3:$G$459,7,FALSE)),IF(VLOOKUP(A10,Calendar!$A$3:$G$459,4,FALSE)=\"S\", \"\", VLOOKUP(A10,Calendar!$A$3:$G$459,4,FALSE))))","v":"F"},{"$f":"IF(Summary!$B$5=3,IF(C10=\"\",\"\",VLOOKUP(A10,Calendar!$A$3:$G$459,5,FALSE)),IF(C10=\"\",\"\",VLOOKUP(A10,Calendar!$A$3:$G$459,2,FALSE)))","v":"2019-08-02"},null,null,null,null,{"$f":"MIN(1440,SUM(E10:H10))","v":0}]
[803,null,{"$f":"IF(ISNA(IF(Summary!$B$5=3,IF(VLOOKUP(A11,Calendar!$A$3:$G$459,7,FALSE)=\"S\", \"\", VLOOKUP(A11,Calendar!$A$3:$G$459,7,FALSE)),IF(VLOOKUP(A11,Calendar!$A$3:$G$459,4,FALSE)=\"S\", \"\", VLOOKUP(A11,Calendar!$A$3:$G$459,4,FALSE)))),\"\",IF(Summary!$B$5=3,IF(VLOOKUP(A11,Calendar!$A$3:$G$459,7,FALSE)=\"S\", \"\", VLOOKUP(A11,Calendar!$A$3:$G$459,7,FALSE)),IF(VLOOKUP(A11,Calendar!$A$3:$G$459,4,FALSE)=\"S\", \"\", VLOOKUP(A11,Calendar!$A$3:$G$459,4,FALSE))))","v":""},{"$f":"IF(Summary!$B$5=3,IF(C11=\"\",\"\",VLOOKUP(A11,Calendar!$A$3:$G$459,5,FALSE)),IF(C11=\"\",\"\",VLOOKUP(A11,Calendar!$A$3:$G$459,2,FALSE)))","v":""},null,null,null,null,0]
[804,null,{"$f":"IF(ISNA(IF(Summary!$B$5=3,IF(VLOOKUP(A12,Calendar!$A$3:$G$459,7,FALSE)=\"S\", \"\", VLOOKUP(A12,Calendar!$A$3:$G$459,7,FALSE)),IF(VLOOKUP(A12,Calendar!$A$3:$G$459,4,FALSE)=\"S\", \"\", VLOOKUP(A12,Calendar!$A$3:$G$459,4,FALSE)))),\"\",IF(Summary!$B$5=3,IF(VLOOKUP(A12,Calendar!$A$3:$G$459,7,FALSE)=\"S\", \"\", VLOOKUP(A12,Calendar!$A$3:$G$459,7,FALSE)),IF(VLOOKUP(A12,Calendar!$A$3:$G$459,4,FALSE)=\"S\", \"\", VLOOKUP(A12,Calendar!$A$3:$G$459,4,FALSE))))","v":""},{"$f":"IF(Summary!$B$5=3,IF(C12=\"\",\"\",VLOOKUP(A12,Calendar!$A$3:$G$459,5,FALSE)),IF(C12=\"\",\"\",VLOOKUP(A12,Calendar!$A$3:$G$459,2,FALSE)))","v":""},null,null,null,null,0]
[805,null,{"$f":"IF(ISNA(IF(Summary!$B$5=3,IF(VLOOKUP(A13,Calendar!$A$3:$G$459,7,FALSE)=\"S\", \"\", VLOOKUP(A13,Calendar!$A$3:$G$459,7,FALSE)),IF(VLOOKUP(A13,Calendar!$A$3:$G$459,4,FALSE)=\"S\", \"\", VLOOKUP(A13,Calendar!$A$3:$G$459,4,FALSE)))),\"\",IF(Summary!$B$5=3,IF(VLOOKUP(A13,Calendar!$A$3:$G$459,7,FALSE)=\"S\", \"\", VLOOKUP(A13,Calendar!$A$3:$G$459,7,FALSE)),IF(VLOOKUP(A13,Calendar!$A$3:$G$459,4,FALSE)=\"S\", \"\", VLOOKUP(A13,Calendar!$A$3:$G$459,4,FALSE))))","v":"M"},{"$f":"IF(Summary!$B$5=3,IF(C13=\"\",\"\",VLOOKUP(A13,Calendar!$A$3:$G$459,5,FALSE)),IF(C13=\"\",\"\",VLOOKUP(A13,Calendar!$A$3:$G$459,2,FALSE)))","v":"2019-08-05"},null,null,null,null,0]
[806,null,{"$f":"IF(ISNA(IF(Summary!$B$5=3,IF(VLOOKUP(A14,Calendar!$A$3:$G$459,7,FALSE)=\"S\", \"\", VLOOKUP(A14,Calendar!$A$3:$G$459,7,FALSE)),IF(VLOOKUP(A14,Calendar!$A$3:$G$459,4,FALSE)=\"S\", \"\", VLOOKUP(A14,Calendar!$A$3:$G$459,4,FALSE)))),\"\",IF(Summary!$B$5=3,IF(VLOOKUP(A14,Calendar!$A$3:$G$459,7,FALSE)=\"S\", \"\", VLOOKUP(A14,Calendar!$A$3:$G$459,7,FALSE)),IF(VLOOKUP(A14,Calendar!$A$3:$G$459,4,FALSE)=\"S\", \"\", VLOOKUP(A14,Calendar!$A$3:$G$459,4,FALSE))))","v":"T"},{"$f":"IF(Summary!$B$5=3,IF(C14=\"\",\"\",VLOOKUP(A14,Calendar!$A$3:$G$459,5,FALSE)),IF(C14=\"\",\"\",VLOOKUP(A14,Calendar!$A$3:$G$459,2,FALSE)))","v":"2019-08-06"},null,null,null,null,0]
[807,null,{"$f":"IF(ISNA(IF(Summary!$B$5=3,IF(VLOOKUP(A15,Calendar!$A$3:$G$459,7,FALSE)=\"S\", \"\", VLOOKUP(A15,Calendar!$A$3:$G$459,7,FALSE)),IF(VLOOKUP(A15,Calendar!$A$3:$G$459,4,FALSE)=\"S\", \"\", VLOOKUP(A15,Calendar!$A$3:$G$459,4,FALSE)))),\"\",IF(Summary!$B$5=3,IF(VLOOKUP(A15,Calendar!$A$3:$G$459,7,FALSE)=\"S\", \"\", VLOOKUP(A15,Calendar!$A$3:$G$459,7,FALSE)),IF(VLOOKUP(A15,Calendar!$A$3:$G$459,4,FALSE)=\"S\", \"\", VLOOKUP(A15,Calendar!$A$3:$G$459,4,FALSE))))","v":"W"},{"$f":"IF(Summary!$B$5=3,IF(C15=\"\",\"\",VLOOKUP(A15,Calendar!$A$3:$G$459,5,FALSE)),IF(C15=\"\",\"\",VLOOKUP(A15,Calendar!$A$3:$G$459,2,FALSE)))","v":"2019-08-07"},null,null,null,null,0]
[808,null,{"$f":"IF(ISNA(IF(Summary!$B$5=3,IF(VLOOKUP(A16,Calendar!$A$3:$G$459,7,FALSE)=\"S\", \"\", VLOOKUP(A16,Calendar!$A$3:$G$459,7,FALSE)),IF(VLOOKUP(A16,Calendar!$A$3:$G$459,4,FALSE)=\"S\", \"\", VLOOKUP(A16,Calendar!$A$3:$G$459,4,FALSE)))),\"\",IF(Summary!$B$5=3,IF(VLOOKUP(A16,Calendar!$A$3:$G$459,7,FALSE)=\"S\", \"\", VLOOKUP(A16,Calendar!$A$3:$G$459,7,FALSE)),IF(VLOOKUP(A16,Calendar!$A$3:$G$459,4,FALSE)=\"S\", \"\", VLOOKUP(A16,Calendar!$A$3:$G$459,4,FALSE))))","v":"R"},{"$f":"IF(Summary!$B$5=3,IF(C16=\"\",\"\",VLOOKUP(A16,Calendar!$A$3:$G$459,5,FALSE)),IF(C16=\"\",\"\",VLOOKUP(A16,Calendar!$A$3:$G$459,2,FALSE)))","v":"2019-08-08"},null,null,null,null,0]
[809,null,{"$f":"IF(ISNA(IF(Summary!$B$5=3,IF(VLOOKUP(A17,Calendar!$A$3:$G$459,7,FALSE)=\"S\", \"\", VLOOKUP(A17,Calendar!$A$3:$G$459,7,FALSE)),IF(VLOOKUP(A17,Calendar!$A$3:$G$459,4,FALSE)=\"S\", \"\", VLOOKUP(A17,Calendar!$A$3:$G$459,4,FALSE)))),\"\",IF(Summary!$B$5=3,IF(VLOOKUP(A17,Calendar!$A$3:$G$459,7,FALSE)=\"S\", \"\", VLOOKUP(A17,Calendar!$A$3:$G$459,7,FALSE)),IF(VLOOKUP(A17,Calendar!$A$3:$G$459,4,FALSE)=\"S\", \"\", VLOOKUP(A17,Calendar!$A$3:$G$459,4,FALSE))))","v":"F"},{"$f":"IF(Summary!$B$5=3,IF(C17=\"\",\"\",VLOOKUP(A17,Calendar!$A$3:$G$459,5,FALSE)),IF(C17=\"\",\"\",VLOOKUP(A17,Calendar!$A$3:$G$459,2,FALSE)))","v":"2019-08-09"},null,null,null,null,0]
[810,null,{"$f":"IF(ISNA(IF(Summary!$B$5=3,IF(VLOOKUP(A18,Calendar!$A$3:$G$459,7,FALSE)=\"S\", \"\", VLOOKUP(A18,Calendar!$A$3:$G$459,7,FALSE)),IF(VLOOKUP(A18,Calendar!$A$3:$G$459,4,FALSE)=\"S\", \"\", VLOOKUP(A18,Calendar!$A$3:$G$459,4,FALSE)))),\"\",IF(Summary!$B$5=3,IF(VLOOKUP(A18,Calendar!$A$3:$G$459,7,FALSE)=\"S\", \"\", VLOOKUP(A18,Calendar!$A$3:$G$459,7,FALSE)),IF(VLOOKUP(A18,Calendar!$A$3:$G$459,4,FALSE)=\"S\", \"\", VLOOKUP(A18,Calendar!$A$3:$G$459,4,FALSE))))","v":""},{"$f":"IF(Summary!$B$5=3,IF(C18=\"\",\"\",VLOOKUP(A18,Calendar!$A$3:$G$459,5,FALSE)),IF(C18=\"\",\"\",VLOOKUP(A18,Calendar!$A$3:$G$459,2,FALSE)))","v":""},null,null,null,null,0]
[811,null,{"$f":"IF(ISNA(IF(Summary!$B$5=3,IF(VLOOKUP(A19,Calendar!$A$3:$G$459,7,FALSE)=\"S\", \"\", VLOOKUP(A19,Calendar!$A$3:$G$459,7,FALSE)),IF(VLOOKUP(A19,Calendar!$A$3:$G$459,4,FALSE)=\"S\", \"\", VLOOKUP(A19,Calendar!$A$3:$G$459,4,FALSE)))),\"\",IF(Summary!$B$5=3,IF(VLOOKUP(A19,Calendar!$A$3:$G$459,7,FALSE)=\"S\", \"\", VLOOKUP(A19,Calendar!$A$3:$G$459,7,FALSE)),IF(VLOOKUP(A19,Calendar!$A$3:$G$459,4,FALSE)=\"S\", \"\", VLOOKUP(A19,Calendar!$A$3:$G$459,4,FALSE))))","v":""},{"$f":"IF(Summary!$B$5=3,IF(C19=\"\",\"\",VLOOKUP(A19,Calendar!$A$3:$G$459,5,FALSE)),IF(C19=\"\",\"\",VLOOKUP(A19,Calendar!$A$3:$G$459,2,FALSE)))","v":""},null,null,null,null,0]
[812,null,{"$f":"IF(ISNA(IF(Summary!$B$5=3,IF(VLOOKUP(A20,Calendar!$A$3:$G$459,7,FALSE)=\"S\", \"\", VLOOKUP(A20,Calendar!$A$3:$G$459,7,FALSE)),IF(VLOOKUP(A20,Calendar!$A$3:$G$459,4,FALSE)=\"S\", \"\", VLOOKUP(A20,Calendar!$A$3:$G$459,4,FALSE)))),\"\",IF(Summary!$B$5=3,IF(VLOOKUP(A20,Calendar!$A$3:$G$459,7,FALSE)=\"S\", \"\", VLOOKUP(A20,Calendar!$A$3:$G$459,7,FALSE)),IF(VLOOKUP(A20,Calendar!$A$3:$G$459,4,FALSE)=\"S\", \"\", VLOOKUP(A20,Calendar!$A$3:$G$459,4,FALSE))))","v":"M"},{"$f":"IF(Summary!$B$5=3,IF(C20=\"\",\"\",VLOOKUP(A20,Calendar!$A$3:$G$459,5,FALSE)),IF(C20=\"\",\"\",VLOOKUP(A20,Calendar!$A$3:$G$459,2,FALSE)))","v":"2019-08-12"},null,null,null,null,0]
[813,null,{"$f":"IF(ISNA(IF(Summary!$B$5=3,IF(VLOOKUP(A21,Calendar!$A$3:$G$459,7,FALSE)=\"S\", \"\", VLOOKUP(A21,Calendar!$A$3:$G$459,7,FALSE)),IF(VLOOKUP(A21,Calendar!$A$3:$G$459,4,FALSE)=\"S\", \"\", VLOOKUP(A21,Calendar!$A$3:$G$459,4,FALSE)))),\"\",IF(Summary!$B$5=3,IF(VLOOKUP(A21,Calendar!$A$3:$G$459,7,FALSE)=\"S\", \"\", VLOOKUP(A21,Calendar!$A$3:$G$459,7,FALSE)),IF(VLOOKUP(A21,Calendar!$A$3:$G$459,4,FALSE)=\"S\", \"\", VLOOKUP(A21,Calendar!$A$3:$G$459,4,FALSE))))","v":"T"},{"$f":"IF(Summary!$B$5=3,IF(C21=\"\",\"\",VLOOKUP(A21,Calendar!$A$3:$G$459,5,FALSE)),IF(C21=\"\",\"\",VLOOKUP(A21,Calendar!$A$3:$G$459,2,FALSE)))","v":"2019-08-13"},null,null,null,null,0]
[814,null,{"$f":"IF(ISNA(IF(Summary!$B$5=3,IF(VLOOKUP(A22,Calendar!$A$3:$G$459,7,FALSE)=\"S\", \"\", VLOOKUP(A22,Calendar!$A$3:$G$459,7,FALSE)),IF(VLOOKUP(A22,Calendar!$A$3:$G$459,4,FALSE)=\"S\", \"\", VLOOKUP(A22,Calendar!$A$3:$G$459,4,FALSE)))),\"\",IF(Summary!$B$5=3,IF(VLOOKUP(A22,Calendar!$A$3:$G$459,7,FALSE)=\"S\", \"\", VLOOKUP(A22,Calendar!$A$3:$G$459,7,FALSE)),IF(VLOOKUP(A22,Calendar!$A$3:$G$459,4,FALSE)=\"S\", \"\", VLOOKUP(A22,Calendar!$A$3:$G$459,4,FALSE))))","v":"W"},{"$f":"IF(Summary!$B$5=3,IF(C22=\"\",\"\",VLOOKUP(A22,Calendar!$A$3:$G$459,5,FALSE)),IF(C22=\"\",\"\",VLOOKUP(A22,Calendar!$A$3:$G$459,2,FALSE)))","v":"2019-08-14"},null,null,null,null,0]
[815,null,{"$f":"IF(ISNA(IF(Summary!$B$5=3,IF(VLOOKUP(A23,Calendar!$A$3:$G$459,7,FALSE)=\"S\", \"\", VLOOKUP(A23,Calendar!$A$3:$G$459,7,FALSE)),IF(VLOOKUP(A23,Calendar!$A$3:$G$459,4,FALSE)=\"S\", \"\", VLOOKUP(A23,Calendar!$A$3:$G$459,4,FALSE)))),\"\",IF(Summary!$B$5=3,IF(VLOOKUP(A23,Calendar!$A$3:$G$459,7,FALSE)=\"S\", \"\", VLOOKUP(A23,Calendar!$A$3:$G$459,7,FALSE)),IF(VLOOKUP(A23,Calendar!$A$3:$G$459,4,FALSE)=\"S\", \"\", VLOOKUP(A23,Calendar!$A$3:$G$459,4,FALSE))))","v":"R"},{"$f":"IF(Summary!$B$5=3,IF(C23=\"\",\"\",VLOOKUP(A23,Calendar!$A$3:$G$459,5,FALSE)),IF(C23=\"\",\"\",VLOOKUP(A23,Calendar!$A$3:$G$459,2,FALSE)))","v":"2019-08-15"},null,null,null,null,0]
[816,null,{"$f":"IF(ISNA(IF(Summary!$B$5=3,IF(VLOOKUP(A24,Calendar!$A$3:$G$459,7,FALSE)=\"S\", \"\", VLOOKUP(A24,Calendar!$A$3:$G$459,7,FALSE)),IF(VLOOKUP(A24,Calendar!$A$3:$G$459,4,FALSE)=\"S\", \"\", VLOOKUP(A24,Calendar!$A$3:$G$459,4,FALSE)))),\"\",IF(Summary!$B$5=3,IF(VLOOKUP(A24,Calendar!$A$3:$G$459,7,FALSE)=\"S\", \"\", VLOOKUP(A24,Calendar!$A$3:$G$459,7,FALSE)),IF(VLOOKUP(A24,Calendar!$A$3:$G$459,4,FALSE)=\"S\", \"\", VLOOKUP(A24,Calendar!$A$3:$G$459,4,FALSE))))","v":"F"},{"$f":"IF(Summary!$B$5=3,IF(C24=\"\",\"\",VLOOKUP(A24,Calendar!$A$3:$G$459,5,FALSE)),IF(C24=\"\",\"\",VLOOKUP(A24,Calendar!$A$3:$G$459,2,FALSE)))","v":"2019-08-16"},null,null,null,null,0]
[817,null,{"$f":"IF(ISNA(IF(Summary!$B$5=3,IF(VLOOKUP(A25,Calendar!$A$3:$G$459,7,FALSE)=\"S\", \"\", VLOOKUP(A25,Calendar!$A$3:$G$459,7,FALSE)),IF(VLOOKUP(A25,Calendar!$A$3:$G$459,4,FALSE)=\"S\", \"\", VLOOKUP(A25,Calendar!$A$3:$G$459,4,FALSE)))),\"\",IF(Summary!$B$5=3,IF(VLOOKUP(A25,Calendar!$A$3:$G$459,7,FALSE)=\"S\", \"\", VLOOKUP(A25,Calendar!$A$3:$G$459,7,FALSE)),IF(VLOOKUP(A25,Calendar!$A$3:$G$459,4,FALSE)=\"S\", \"\", VLOOKUP(A25,Calendar!$A$3:$G$459,4,FALSE))))","v":""},{"$f":"IF(Summary!$B$5=3,IF(C25=\"\",\"\",VLOOKUP(A25,Calendar!$A$3:$G$459,5,FALSE)),IF(C25=\"\",\"\",VLOOKUP(A25,Calendar!$A$3:$G$459,2,FALSE)))","v":""},null,null,null,null,0]
[818,null,{"$f":"IF(ISNA(IF(Summary!$B$5=3,IF(VLOOKUP(A26,Calendar!$A$3:$G$459,7,FALSE)=\"S\", \"\", VLOOKUP(A26,Calendar!$A$3:$G$459,7,FALSE)),IF(VLOOKUP(A26,Calendar!$A$3:$G$459,4,FALSE)=\"S\", \"\", VLOOKUP(A26,Calendar!$A$3:$G$459,4,FALSE)))),\"\",IF(Summary!$B$5=3,IF(VLOOKUP(A26,Calendar!$A$3:$G$459,7,FALSE)=\"S\", \"\", VLOOKUP(A26,Calendar!$A$3:$G$459,7,FALSE)),IF(VLOOKUP(A26,Calendar!$A$3:$G$459,4,FALSE)=\"S\", \"\", VLOOKUP(A26,Calendar!$A$3:$G$459,4,FALSE))))","v":""},{"$f":"IF(Summary!$B$5=3,IF(C26=\"\",\"\",VLOOKUP(A26,Calendar!$A$3:$G$459,5,FALSE)),IF(C26=\"\",\"\",VLOOKUP(A26,Calendar!$A$3:$G$459,2,FALSE)))","v":""},null,null,null,null,0]
[819,null,{"$f":"IF(ISNA(IF(Summary!$B$5=3,IF(VLOOKUP(A27,Calendar!$A$3:$G$459,7,FALSE)=\"S\", \"\", VLOOKUP(A27,Calendar!$A$3:$G$459,7,FALSE)),IF(VLOOKUP(A27,Calendar!$A$3:$G$459,4,FALSE)=\"S\", \"\", VLOOKUP(A27,Calendar!$A$3:$G$459,4,FALSE)))),\"\",IF(Summary!$B$5=3,IF(VLOOKUP(A27,Calendar!$A$3:$G$459,7,FALSE)=\"S\", \"\", VLOOKUP(A27,Calendar!$A$3:$G$459,7,FALSE)),IF(VLOOKUP(A27,Calendar!$A$3:$G$459,4,FALSE)=\"S\", \"\", VLOOKUP(A27,Calendar!$A$3:$G$459,4,FALSE))))","v":"M"},{"$f":"IF(Summary!$B$5=3,IF(C27=\"\",\"\",VLOOKUP(A27,Calendar!$A$3:$G$459,5,FALSE)),IF(C27=\"\",\"\",VLOOKUP(A27,Calendar!$A$3:$G$459,2,FALSE)))","v":"2019-08-19"},null,null,null,null,0]
[820,null,{"$f":"IF(ISNA(IF(Summary!$B$5=3,IF(VLOOKUP(A28,Calendar!$A$3:$G$459,7,FALSE)=\"S\", \"\", VLOOKUP(A28,Calendar!$A$3:$G$459,7,FALSE)),IF(VLOOKUP(A28,Calendar!$A$3:$G$459,4,FALSE)=\"S\", \"\", VLOOKUP(A28,Calendar!$A$3:$G$459,4,FALSE)))),\"\",IF(Summary!$B$5=3,IF(VLOOKUP(A28,Calendar!$A$3:$G$459,7,FALSE)=\"S\", \"\", VLOOKUP(A28,Calendar!$A$3:$G$459,7,FALSE)),IF(VLOOKUP(A28,Calendar!$A$3:$G$459,4,FALSE)=\"S\", \"\", VLOOKUP(A28,Calendar!$A$3:$G$459,4,FALSE))))","v":"T"},{"$f":"IF(Summary!$B$5=3,IF(C28=\"\",\"\",VLOOKUP(A28,Calendar!$A$3:$G$459,5,FALSE)),IF(C28=\"\",\"\",VLOOKUP(A28,Calendar!$A$3:$G$459,2,FALSE)))","v":"2019-08-20"},null,null,null,null,0]
[821,null,{"$f":"IF(ISNA(IF(Summary!$B$5=3,IF(VLOOKUP(A29,Calendar!$A$3:$G$459,7,FALSE)=\"S\", \"\", VLOOKUP(A29,Calendar!$A$3:$G$459,7,FALSE)),IF(VLOOKUP(A29,Calendar!$A$3:$G$459,4,FALSE)=\"S\", \"\", VLOOKUP(A29,Calendar!$A$3:$G$459,4,FALSE)))),\"\",IF(Summary!$B$5=3,IF(VLOOKUP(A29,Calendar!$A$3:$G$459,7,FALSE)=\"S\", \"\", VLOOKUP(A29,Calendar!$A$3:$G$459,7,FALSE)),IF(VLOOKUP(A29,Calendar!$A$3:$G$459,4,FALSE)=\"S\", \"\", VLOOKUP(A29,Calendar!$A$3:$G$459,4,FALSE))))","v":"W"},{"$f":"IF(Summary!$B$5=3,IF(C29=\"\",\"\",VLOOKUP(A29,Calendar!$A$3:$G$459,5,FALSE)),IF(C29=\"\",\"\",VLOOKUP(A29,Calendar!$A$3:$G$459,2,FALSE)))","v":"2019-08-21"},null,null,null,null,0]
[822,null,{"$f":"IF(ISNA(IF(Summary!$B$5=3,IF(VLOOKUP(A30,Calendar!$A$3:$G$459,7,FALSE)=\"S\", \"\", VLOOKUP(A30,Calendar!$A$3:$G$459,7,FALSE)),IF(VLOOKUP(A30,Calendar!$A$3:$G$459,4,FALSE)=\"S\", \"\", VLOOKUP(A30,Calendar!$A$3:$G$459,4,FALSE)))),\"\",IF(Summary!$B$5=3,IF(VLOOKUP(A30,Calendar!$A$3:$G$459,7,FALSE)=\"S\", \"\", VLOOKUP(A30,Calendar!$A$3:$G$459,7,FALSE)),IF(VLOOKUP(A30,Calendar!$A$3:$G$459,4,FALSE)=\"S\", \"\", VLOOKUP(A30,Calendar!$A$3:$G$459,4,FALSE))))","v":"R"},{"$f":"IF(Summary!$B$5=3,IF(C30=\"\",\"\",VLOOKUP(A30,Calendar!$A$3:$G$459,5,FALSE)),IF(C30=\"\",\"\",VLOOKUP(A30,Calendar!$A$3:$G$459,2,FALSE)))","v":"2019-08-22"},null,null,null,null,0]
[823,null,{"$f":"IF(ISNA(IF(Summary!$B$5=3,IF(VLOOKUP(A31,Calendar!$A$3:$G$459,7,FALSE)=\"S\", \"\", VLOOKUP(A31,Calendar!$A$3:$G$459,7,FALSE)),IF(VLOOKUP(A31,Calendar!$A$3:$G$459,4,FALSE)=\"S\", \"\", VLOOKUP(A31,Calendar!$A$3:$G$459,4,FALSE)))),\"\",IF(Summary!$B$5=3,IF(VLOOKUP(A31,Calendar!$A$3:$G$459,7,FALSE)=\"S\", \"\", VLOOKUP(A31,Calendar!$A$3:$G$459,7,FALSE)),IF(VLOOKUP(A31,Calendar!$A$3:$G$459,4,FALSE)=\"S\", \"\", VLOOKUP(A31,Calendar!$A$3:$G$459,4,FALSE))))","v":"F"},{"$f":"IF(Summary!$B$5=3,IF(C31=\"\",\"\",VLOOKUP(A31,Calendar!$A$3:$G$459,5,FALSE)),IF(C31=\"\",\"\",VLOOKUP(A31,Calendar!$A$3:$G$459,2,FALSE)))","v":"2019-08-23"},null,null,null,null,0]
[824,null,{"$f":"IF(ISNA(IF(Summary!$B$5=3,IF(VLOOKUP(A32,Calendar!$A$3:$G$459,7,FALSE)=\"S\", \"\", VLOOKUP(A32,Calendar!$A$3:$G$459,7,FALSE)),IF(VLOOKUP(A32,Calendar!$A$3:$G$459,4,FALSE)=\"S\", \"\", VLOOKUP(A32,Calendar!$A$3:$G$459,4,FALSE)))),\"\",IF(Summary!$B$5=3,IF(VLOOKUP(A32,Calendar!$A$3:$G$459,7,FALSE)=\"S\", \"\", VLOOKUP(A32,Calendar!$A$3:$G$459,7,FALSE)),IF(VLOOKUP(A32,Calendar!$A$3:$G$459,4,FALSE)=\"S\", \"\", VLOOKUP(A32,Calendar!$A$3:$G$459,4,FALSE))))","v":""},{"$f":"IF(Summary!$B$5=3,IF(C32=\"\",\"\",VLOOKUP(A32,Calendar!$A$3:$G$459,5,FALSE)),IF(C32=\"\",\"\",VLOOKUP(A32,Calendar!$A$3:$G$459,2,FALSE)))","v":""},null,null,null,null,0]
[825,null,{"$f":"IF(ISNA(IF(Summary!$B$5=3,IF(VLOOKUP(A33,Calendar!$A$3:$G$459,7,FALSE)=\"S\", \"\", VLOOKUP(A33,Calendar!$A$3:$G$459,7,FALSE)),IF(VLOOKUP(A33,Calendar!$A$3:$G$459,4,FALSE)=\"S\", \"\", VLOOKUP(A33,Calendar!$A$3:$G$459,4,FALSE)))),\"\",IF(Summary!$B$5=3,IF(VLOOKUP(A33,Calendar!$A$3:$G$459,7,FALSE)=\"S\", \"\", VLOOKUP(A33,Calendar!$A$3:$G$459,7,FALSE)),IF(VLOOKUP(A33,Calendar!$A$3:$G$459,4,FALSE)=\"S\", \"\", VLOOKUP(A33,Calendar!$A$3:$G$459,4,FALSE))))","v":""},{"$f":"IF(Summary!$B$5=3,IF(C33=\"\",\"\",VLOOKUP(A33,Calendar!$A$3:$G$459,5,FALSE)),IF(C33=\"\",\"\",VLOOKUP(A33,Calendar!$A$3:$G$459,2,FALSE)))","v":""},null,null,null,null,0]
[826,null,{"$f":"IF(ISNA(IF(Summary!$B$5=3,IF(VLOOKUP(A34,Calendar!$A$3:$G$459,7,FALSE)=\"S\", \"\", VLOOKUP(A34,Calendar!$A$3:$G$459,7,FALSE)),IF(VLOOKUP(A34,Calendar!$A$3:$G$459,4,FALSE)=\"S\", \"\", VLOOKUP(A34,Calendar!$A$3:$G$459,4,FALSE)))),\"\",IF(Summary!$B$5=3,IF(VLOOKUP(A34,Calendar!$A$3:$G$459,7,FALSE)=\"S\", \"\", VLOOKUP(A34,Calendar!$A$3:$G$459,7,FALSE)),IF(VLOOKUP(A34,Calendar!$A$3:$G$459,4,FALSE)=\"S\", \"\", VLOOKUP(A34,Calendar!$A$3:$G$459,4,FALSE))))","v":"M"},{"$f":"IF(Summary!$B$5=3,IF(C34=\"\",\"\",VLOOKUP(A34,Calendar!$A$3:$G$459,5,FALSE)),IF(C34=\"\",\"\",VLOOKUP(A34,Calendar!$A$3:$G$459,2,FALSE)))","v":"2019-08-26"},null,null,null,null,0]
[827,null,{"$f":"IF(ISNA(IF(Summary!$B$5=3,IF(VLOOKUP(A35,Calendar!$A$3:$G$459,7,FALSE)=\"S\", \"\", VLOOKUP(A35,Calendar!$A$3:$G$459,7,FALSE)),IF(VLOOKUP(A35,Calendar!$A$3:$G$459,4,FALSE)=\"S\", \"\", VLOOKUP(A35,Calendar!$A$3:$G$459,4,FALSE)))),\"\",IF(Summary!$B$5=3,IF(VLOOKUP(A35,Calendar!$A$3:$G$459,7,FALSE)=\"S\", \"\", VLOOKUP(A35,Calendar!$A$3:$G$459,7,FALSE)),IF(VLOOKUP(A35,Calendar!$A$3:$G$459,4,FALSE)=\"S\", \"\", VLOOKUP(A35,Calendar!$A$3:$G$459,4,FALSE))))","v":"T"},{"$f":"IF(Summary!$B$5=3,IF(C35=\"\",\"\",VLOOKUP(A35,Calendar!$A$3:$G$459,5,FALSE)),IF(C35=\"\",\"\",VLOOKUP(A35,Calendar!$A$3:$G$459,2,FALSE)))","v":"2019-08-27"},null,null,null,null,0]
[828,null,{"$f":"IF(ISNA(IF(Summary!$B$5=3,IF(VLOOKUP(A36,Calendar!$A$3:$G$459,7,FALSE)=\"S\", \"\", VLOOKUP(A36,Calendar!$A$3:$G$459,7,FALSE)),IF(VLOOKUP(A36,Calendar!$A$3:$G$459,4,FALSE)=\"S\", \"\", VLOOKUP(A36,Calendar!$A$3:$G$459,4,FALSE)))),\"\",IF(Summary!$B$5=3,IF(VLOOKUP(A36,Calendar!$A$3:$G$459,7,FALSE)=\"S\", \"\", VLOOKUP(A36,Calendar!$A$3:$G$459,7,FALSE)),IF(VLOOKUP(A36,Calendar!$A$3:$G$459,4,FALSE)=\"S\", \"\", VLOOKUP(A36,Calendar!$A$3:$G$459,4,FALSE))))","v":"W"},{"$f":"IF(Summary!$B$5=3,IF(C36=\"\",\"\",VLOOKUP(A36,Calendar!$A$3:$G$459,5,FALSE)),IF(C36=\"\",\"\",VLOOKUP(A36,Calendar!$A$3:$G$459,2,FALSE)))","v":"2019-08-28"},null,null,null,null,0]
[829,null,{"$f":"IF(ISNA(IF(Summary!$B$5=3,IF(VLOOKUP(A37,Calendar!$A$3:$G$459,7,FALSE)=\"S\", \"\", VLOOKUP(A37,Calendar!$A$3:$G$459,7,FALSE)),IF(VLOOKUP(A37,Calendar!$A$3:$G$459,4,FALSE)=\"S\", \"\", VLOOKUP(A37,Calendar!$A$3:$G$459,4,FALSE)))),\"\",IF(Summary!$B$5=3,IF(VLOOKUP(A37,Calendar!$A$3:$G$459,7,FALSE)=\"S\", \"\", VLOOKUP(A37,Calendar!$A$3:$G$459,7,FALSE)),IF(VLOOKUP(A37,Calendar!$A$3:$G$459,4,FALSE)=\"S\", \"\", VLOOKUP(A37,Calendar!$A$3:$G$459,4,FALSE))))","v":"R"},{"$f":"IF(Summary!$B$5=3,IF(C37=\"\",\"\",VLOOKUP(A37,Calendar!$A$3:$G$459,5,FALSE)),IF(C37=\"\",\"\",VLOOKUP(A37,Calendar!$A$3:$G$459,2,FALSE)))","v":"2019-08-29"},null,null,null,null,0]
[830,null,{"$f":"IF(ISNA(IF(Summary!$B$5=3,IF(VLOOKUP(A38,Calendar!$A$3:$G$459,7,FALSE)=\"S\", \"\", VLOOKUP(A38,Calendar!$A$3:$G$459,7,FALSE)),IF(VLOOKUP(A38,Calendar!$A$3:$G$459,4,FALSE)=\"S\", \"\", VLOOKUP(A38,Calendar!$A$3:$G$459,4,FALSE)))),\"\",IF(Summary!$B$5=3,IF(VLOOKUP(A38,Calendar!$A$3:$G$459,7,FALSE)=\"S\", \"\", VLOOKUP(A38,Calendar!$A$3:$G$459,7,FALSE)),IF(VLOOKUP(A38,Calendar!$A$3:$G$459,4,FALSE)=\"S\", \"\", VLOOKUP(A38,Calendar!$A$3:$G$459,4,FALSE))))","v":"F"},{"$f":"IF(Summary!$B$5=3,IF(C38=\"\",\"\",VLOOKUP(A38,Calendar!$A$3:$G$459,5,FALSE)),IF(C38=\"\",\"\",VLOOKUP(A38,Calendar!$A$3:$G$459,2,FALSE)))","v":"2019-08-30"},null,null,null,null,0]
[831,null,{"$f":"IF(ISNA(IF(Summary!$B$5=3,IF(VLOOKUP(A39,Calendar!$A$3:$G$459,7,FALSE)=\"S\", \"\", VLOOKUP(A39,Calendar!$A$3:$G$459,7,FALSE)),IF(VLOOKUP(A39,Calendar!$A$3:$G$459,4,FALSE)=\"S\", \"\", VLOOKUP(A39,Calendar!$A$3:$G$459,4,FALSE)))),\"\",IF(Summary!$B$5=3,IF(VLOOKUP(A39,Calendar!$A$3:$G$459,7,FALSE)=\"S\", \"\", VLOOKUP(A39,Calendar!$A$3:$G$459,7,FALSE)),IF(VLOOKUP(A39,Calendar!$A$3:$G$459,4,FALSE)=\"S\", \"\", VLOOKUP(A39,Calendar!$A$3:$G$459,4,FALSE))))","v":""},{"$f":"IF(Summary!$B$5=3,IF(C39=\"\",\"\",VLOOKUP(A39,Calendar!$A$3:$G$459,5,FALSE)),IF(C39=\"\",\"\",VLOOKUP(A39,Calendar!$A$3:$G$459,2,FALSE)))","v":""},null,null,null,null,0]
[null,null,null,"Total Minutes",{"$f":"SUM(E9:E39)","v":0},{"$f":"SUM(F9:F39)","v":0},0,0,0]
[null,null,null,"Total Hours",{"$f":"E40/60","v":0},{"$f":"F40/60","v":0},0,0,0]
[]
[]
[null,null,"Notes"]
[]
[]
[]
[]
[]
[]
[]
[]
[]
[]
[null,null,null,null,"Kansas State Department of Education",null,null,null,"Personnel Activity Report"]
[null,null,null,null,"Fiscal Auditing",null,null,null,"Updated 9/20/18"]
[null,null,null,null,"785-296-4976"]
[null,null,null,null,"https://www.ksde.org/Agency/Fiscal-and-Administrative-Services/Fiscal-Auditing"]
[]
[]
[null,null,"The Kansas State Department of Education does not discriminate on the basis of race, color, national origin, sex, disability, or age in its programs and activities and provides equal access to the Boy Scouts and other designated youth groups. The following person has been designated to handle inquiries regarding the nondiscrimination policies: KSDE General Counsel, Office of General Counsel, KSDE, Landon State Office Building, 900 S.W. Jackson, Suite 102, Topeka, KS 66612, (785) 296-3204."]

{"sheet":"September","index":4,"n_rows":61,"n_cols":12,"rows_kept":61,"cut":false,"hidden":false,"merged":[[2,2,2,8],[48,2,48,8],[49,2,49,8],[43,3,43,8],[44,2,44,8],[45,2,45,8],[46,2,46,8],[47,2,47,8],[60,2,61,8],[3,2,3,8],[4,2,4,8],[5,2,5,8],[6,2,6,8]]}
[]
[]
[null,null,"Personnel Activity Report"]
[null,null,"Regular School Year"]
[null,null,"September"]
[null,null,{"$f":"IF(Summary!$E$8<>\"\",Summary!$E$8,\" \")","v":" "}]
[null,null,{"$f":"IF(Summary!$E$9<>\"\",Summary!$E$9,\" \")","v":" "}]
[null,null,"Day","Date","Special Ed","General Ed","Other","Other","Totals"]
[901,null,{"$f":"IF(ISNA(IF(Summary!$B$5=3,IF(VLOOKUP(A9,Calendar!$A$3:$G$459,7,FALSE)=\"S\", \"\", VLOOKUP(A9,Calendar!$A$3:$G$459,7,FALSE)),IF(VLOOKUP(A9,Calendar!$A$3:$G$459,4,FALSE)=\"S\", \"\", VLOOKUP(A9,Calendar!$A$3:$G$459,4,FALSE)))),\"\",IF(Summary!$B$5=3,IF(VLOOKUP(A9,Calendar!$A$3:$G$459,7,FALSE)=\"S\", \"\", VLOOKUP(A9,Calendar!$A$3:$G$459,7,FALSE)),IF(VLOOKUP(A9,Calendar!$A$3:$G$459,4,FALSE)=\"S\", \"\", VLOOKUP(A9,Calendar!$A$3:$G$459,4,FALSE))))","v":""},{"$f":"IF(Summary!$B$5=3,IF(C9=\"\",\"\",VLOOKUP(A9,Calendar!$A$3:$G$459,5,FALSE)),IF(C9=\"\",\"\",VLOOKUP(A9,Calendar!$A$3:$G$459,2,FALSE)))","v":""},null,null,null,null,{"$f":"MIN(1440,SUM(E9:H9))","v":0},null,null,{"$f":"IF(I9>390, \"<<< Day exceeds 390 minutes. Confirm reported time.\",\"\")","v":""}]
[902,null,{"$f":"IF(ISNA(IF(Summary!$B$5=3,IF(VLOOKUP(A10,Calendar!$A$3:$G$459,7,FALSE)=\"S\", \"\", VLOOKUP(A10,Calendar!$A$3:$G$459,7,FALSE)),IF(VLOOKUP(A10,Calendar!$A$3:$G$459,4,FALSE)=\"S\", \"\", VLOOKUP(A10,Calendar!$A$3:$G$459,4,FALSE)))),\"\",IF(Summary!$B$5=3,IF(VLOOKUP(A10,Calendar!$A$3:$G$459,7,FALSE)=\"S\", \"\", VLOOKUP(A10,Calendar!$A$3:$G$459,7,FALSE)),IF(VLOOKUP(A10,Calendar!$A$3:$G$459,4,FALSE)=\"S\", \"\", VLOOKUP(A10,Calendar!$A$3:$G$459,4,FALSE))))","v":"M"},{"$f":"IF(Summary!$B$5=3,IF(C10=\"\",\"\",VLOOKUP(A10,Calendar!$A$3:$G$459,5,FALSE)),IF(C10=\"\",\"\",VLOOKUP(A10,Calendar!$A$3:$G$459,2,FALSE)))","v":"2019-09-02"},null,null,null,null,{"$f":"MIN(1440,SUM(E10:H10))","v":0},null,null,{"$f":"IF(I10>390, \"<<< Day exceeds 390 minutes. Confirm reported time.\",\"\")","v":""}]
[903,null,{"$f":"IF(ISNA(IF(Summary!$B$5=3,IF(VLOOKUP(A11,Calendar!$A$3:$G$459,7,FALSE)=\"S\", \"\", VLOOKUP(A11,Calendar!$A$3:$G$459,7,FALSE)),IF(VLOOKUP(A11,Calendar!$A$3:$G$459,4,FALSE)=\"S\", \"\", VLOOKUP(A11,Calendar!$A$3:$G$459,4,FALSE)))),\"\",IF(Summary!$B$5=3,IF(VLOOKUP(A11,Calendar!$A$3:$G$459,7,FALSE)=\"S\", \"\", VLOOKUP(A11,Calendar!$A$3:$G$459,7,FALSE)),IF(VLOOKUP(A11,Calendar!$A$3:$G$459,4,FALSE)=\"S\", \"\", VLOOKUP(A11,Calendar!$A$3:$G$459,4,FALSE))))","v":"T"},{"$f":"IF(Summary!$B$5=3,IF(C11=\"\",\"\",VLOOKUP(A11,Calendar!$A$3:$G$459,5,FALSE)),IF(C11=\"\",\"\",VLOOKUP(A11,Calendar!$A$3:$G$459,2,FALSE)))","v":"2019-09-03"},null,null,null,null,0,null,null,""]
[904,null,{"$f":"IF(ISNA(IF(Summary!$B$5=3,IF(VLOOKUP(A12,Calendar!$A$3:$G$459,7,FALSE)=\"S\", \"\", VLOOKUP(A12,Calendar!$A$3:$G$459,7,FALSE)),IF(VLOOKUP(A12,Calendar!$A$3:$G$459,4,FALSE)=\"S\", \"\", VLOOKUP(A12,Calendar!$A$3:$G$459,4,FALSE)))),\"\",IF(Summary!$B$5=3,IF(VLOOKUP(A12,Calendar!$A$3:$G$459,7,FALSE)=\"S\", \"\", VLOOKUP(A12,Calendar!$A$3:$G$459,7,FALSE)),IF(VLOOKUP(A12,Calendar!$A$3:$G$459,4,FALSE)=\"S\", \"\", VLOOKUP(A12,Calendar!$A$3:$G$459,4,FALSE))))","v":"W"},{"$f":"IF(Summary!$B$5=3,IF(C12=\"\",\"\",VLOOKUP(A12,Calendar!$A$3:$G$459,5,FALSE)),IF(C12=\"\",\"\",VLOOKUP(A12,Calendar!$A$3:$G$459,2,FALSE)))","v":"2019-09-04"},null,null,null,null,0,null,null,""]
[905,null,{"$f":"IF(ISNA(IF(Summary!$B$5=3,IF(VLOOKUP(A13,Calendar!$A$3:$G$459,7,FALSE)=\"S\", \"\", VLOOKUP(A13,Calendar!$A$3:$G$459,7,FALSE)),IF(VLOOKUP(A13,Calendar!$A$3:$G$459,4,FALSE)=\"S\", \"\", VLOOKUP(A13,Calendar!$A$3:$G$459,4,FALSE)))),\"\",IF(Summary!$B$5=3,IF(VLOOKUP(A13,Calendar!$A$3:$G$459,7,FALSE)=\"S\", \"\", VLOOKUP(A13,Calendar!$A$3:$G$459,7,FALSE)),IF(VLOOKUP(A13,Calendar!$A$3:$G$459,4,FALSE)=\"S\", \"\", VLOOKUP(A13,Calendar!$A$3:$G$459,4,FALSE))))","v":"R"},{"$f":"IF(Summary!$B$5=3,IF(C13=\"\",\"\",VLOOKUP(A13,Calendar!$A$3:$G$459,5,FALSE)),IF(C13=\"\",\"\",VLOOKUP(A13,Calendar!$A$3:$G$459,2,FALSE)))","v":"2019-09-05"},null,null,null,null,0,null,null,""]
[906,null,{"$f":"IF(ISNA(IF(Summary!$B$5=3,IF(VLOOKUP(A14,Calendar!$A$3:$G$459,7,FALSE)=\"S\", \"\", VLOOKUP(A14,Calendar!$A$3:$G$459,7,FALSE)),IF(VLOOKUP(A14,Calendar!$A$3:$G$459,4,FALSE)=\"S\", \"\", VLOOKUP(A14,Calendar!$A$3:$G$459,4,FALSE)))),\"\",IF(Summary!$B$5=3,IF(VLOOKUP(A14,Calendar!$A$3:$G$459,7,FALSE)=\"S\", \"\", VLOOKUP(A14,Calendar!$A$3:$G$459,7,FALSE)),IF(VLOOKUP(A14,Calendar!$A$3:$G$459,4,FALSE)=\"S\", \"\", VLOOKUP(A14,Calendar!$A$3:$G$459,4,FALSE))))","v":"F"},{"$f":"IF(Summary!$B$5=3,IF(C14=\"\",\"\",VLOOKUP(A14,Calendar!$A$3:$G$459,5,FALSE)),IF(C14=\"\",\"\",VLOOKUP(A14,Calendar!$A$3:$G$459,2,FALSE)))","v":"2019-09-06"},null,null,null,null,0,null,null,""]
[907,null,{"$f":"IF(ISNA(IF(Summary!$B$5=3,IF(VLOOKUP(A15,Calendar!$A$3:$G$459,7,FALSE)=\"S\", \"\", VLOOKUP(A15,Calendar!$A$3:$G$459,7,FALSE)),IF(VLOOKUP(A15,Calendar!$A$3:$G$459,4,FALSE)=\"S\", \"\", VLOOKUP(A15,Calendar!$A$3:$G$459,4,FALSE)))),\"\",IF(Summary!$B$5=3,IF(VLOOKUP(A15,Calendar!$A$3:$G$459,7,FALSE)=\"S\", \"\", VLOOKUP(A15,Calendar!$A$3:$G$459,7,FALSE)),IF(VLOOKUP(A15,Calendar!$A$3:$G$459,4,FALSE)=\"S\", \"\", VLOOKUP(A15,Calendar!$A$3:$G$459,4,FALSE))))","v":""},{"$f":"IF(Summary!$B$5=3,IF(C15=\"\",\"\",VLOOKUP(A15,Calendar!$A$3:$G$459,5,FALSE)),IF(C15=\"\",\"\",VLOOKUP(A15,Calendar!$A$3:$G$459,2,FALSE)))","v":""},null,null,null,null,0,null,null,""]
[908,null,{"$f":"IF(ISNA(IF(Summary!$B$5=3,IF(VLOOKUP(A16,Calendar!$A$3:$G$459,7,FALSE)=\"S\", \"\", VLOOKUP(A16,Calendar!$A$3:$G$459,7,FALSE)),IF(VLOOKUP(A16,Calendar!$A$3:$G$459,4,FALSE)=\"S\", \"\", VLOOKUP(A16,Calendar!$A$3:$G$459,4,FALSE)))),\"\",IF(Summary!$B$5=3,IF(VLOOKUP(A16,Calendar!$A$3:$G$459,7,FALSE)=\"S\", \"\", VLOOKUP(A16,Calendar!$A$3:$G$459,7,FALSE)),IF(VLOOKUP(A16,Calendar!$A$3:$G$459,4,FALSE)=\"S\", \"\", VLOOKUP(A16,Calendar!$A$3:$G$459,4,FALSE))))","v":""},{"$f":"IF(Summary!$B$5=3,IF(C16=\"\",\"\",VLOOKUP(A16,Calendar!$A$3:$G$459,5,FALSE)),IF(C16=\"\",\"\",VLOOKUP(A16,Calendar!$A$3:$G$459,2,FALSE)))","v":""},null,null,null,null,0,null,null,""]
[909,null,{"$f":"IF(ISNA(IF(Summary!$B$5=3,IF(VLOOKUP(A17,Calendar!$A$3:$G$459,7,FALSE)=\"S\", \"\", VLOOKUP(A17,Calendar!$A$3:$G$459,7,FALSE)),IF(VLOOKUP(A17,Calendar!$A$3:$G$459,4,FALSE)=\"S\", \"\", VLOOKUP(A17,Calendar!$A$3:$G$459,4,FALSE)))),\"\",IF(Summary!$B$5=3,IF(VLOOKUP(A17,Calendar!$A$3:$G$459,7,FALSE)=\"S\", \"\", VLOOKUP(A17,Calendar!$A$3:$G$459,7,FALSE)),IF(VLOOKUP(A17,Calendar!$A$3:$G$459,4,FALSE)=\"S\", \"\", VLOOKUP(A17,Calendar!$A$3:$G$459,4,FALSE))))","v":"M"},{"$f":"IF(Summary!$B$5=3,IF(C17=\"\",\"\",VLOOKUP(A17,Calendar!$A$3:$G$459,5,FALSE)),IF(C17=\"\",\"\",VLOOKUP(A17,Calendar!$A$3:$G$459,2,FALSE)))","v":"2019-09-09"},null,null,null,null,0,null,null,""]
[910,null,{"$f":"IF(ISNA(IF(Summary!$B$5=3,IF(VLOOKUP(A18,Calendar!$A$3:$G$459,7,FALSE)=\"S\", \"\", VLOOKUP(A18,Calendar!$A$3:$G$459,7,FALSE)),IF(VLOOKUP(A18,Calendar!$A$3:$G$459,4,FALSE)=\"S\", \"\", VLOOKUP(A18,Calendar!$A$3:$G$459,4,FALSE)))),\"\",IF(Summary!$B$5=3,IF(VLOOKUP(A18,Calendar!$A$3:$G$459,7,FALSE)=\"S\", \"\", VLOOKUP(A18,Calendar!$A$3:$G$459,7,FALSE)),IF(VLOOKUP(A18,Calendar!$A$3:$G$459,4,FALSE)=\"S\", \"\", VLOOKUP(A18,Calendar!$A$3:$G$459,4,FALSE))))","v":"T"},{"$f":"IF(Summary!$B$5=3,IF(C18=\"\",\"\",VLOOKUP(A18,Calendar!$A$3:$G$459,5,FALSE)),IF(C18=\"\",\"\",VLOOKUP(A18,Calendar!$A$3:$G$459,2,FALSE)))","v":"2019-09-10"},null,null,null,null,0,null,null,""]
[911,null,{"$f":"IF(ISNA(IF(Summary!$B$5=3,IF(VLOOKUP(A19,Calendar!$A$3:$G$459,7,FALSE)=\"S\", \"\", VLOOKUP(A19,Calendar!$A$3:$G$459,7,FALSE)),IF(VLOOKUP(A19,Calendar!$A$3:$G$459,4,FALSE)=\"S\", \"\", VLOOKUP(A19,Calendar!$A$3:$G$459,4,FALSE)))),\"\",IF(Summary!$B$5=3,IF(VLOOKUP(A19,Calendar!$A$3:$G$459,7,FALSE)=\"S\", \"\", VLOOKUP(A19,Calendar!$A$3:$G$459,7,FALSE)),IF(VLOOKUP(A19,Calendar!$A$3:$G$459,4,FALSE)=\"S\", \"\", VLOOKUP(A19,Calendar!$A$3:$G$459,4,FALSE))))","v":"W"},{"$f":"IF(Summary!$B$5=3,IF(C19=\"\",\"\",VLOOKUP(A19,Calendar!$A$3:$G$459,5,FALSE)),IF(C19=\"\",\"\",VLOOKUP(A19,Calendar!$A$3:$G$459,2,FALSE)))","v":"2019-09-11"},null,null,null,null,0,null,null,""]
[912,null,{"$f":"IF(ISNA(IF(Summary!$B$5=3,IF(VLOOKUP(A20,Calendar!$A$3:$G$459,7,FALSE)=\"S\", \"\", VLOOKUP(A20,Calendar!$A$3:$G$459,7,FALSE)),IF(VLOOKUP(A20,Calendar!$A$3:$G$459,4,FALSE)=\"S\", \"\", VLOOKUP(A20,Calendar!$A$3:$G$459,4,FALSE)))),\"\",IF(Summary!$B$5=3,IF(VLOOKUP(A20,Calendar!$A$3:$G$459,7,FALSE)=\"S\", \"\", VLOOKUP(A20,Calendar!$A$3:$G$459,7,FALSE)),IF(VLOOKUP(A20,Calendar!$A$3:$G$459,4,FALSE)=\"S\", \"\", VLOOKUP(A20,Calendar!$A$3:$G$459,4,FALSE))))","v":"R"},{"$f":"IF(Summary!$B$5=3,IF(C20=\"\",\"\",VLOOKUP(A20,Calendar!$A$3:$G$459,5,FALSE)),IF(C20=\"\",\"\",VLOOKUP(A20,Calendar!$A$3:$G$459,2,FALSE)))","v":"2019-09-12"},null,null,null,null,0,null,null,""]
[913,null,{"$f":"IF(ISNA(IF(Summary!$B$5=3,IF(VLOOKUP(A21,Calendar!$A$3:$G$459,7,FALSE)=\"S\", \"\", VLOOKUP(A21,Calendar!$A$3:$G$459,7,FALSE)),IF(VLOOKUP(A21,Calendar!$A$3:$G$459,4,FALSE)=\"S\", \"\", VLOOKUP(A21,Calendar!$A$3:$G$459,4,FALSE)))),\"\",IF(Summary!$B$5=3,IF(VLOOKUP(A21,Calendar!$A$3:$G$459,7,FALSE)=\"S\", \"\", VLOOKUP(A21,Calendar!$A$3:$G$459,7,FALSE)),IF(VLOOKUP(A21,Calendar!$A$3:$G$459,4,FALSE)=\"S\", \"\", VLOOKUP(A21,Calendar!$A$3:$G$459,4,FALSE))))","v":"F"},{"$f":"IF(Summary!$B$5=3,IF(C21=\"\",\"\",VLOOKUP(A21,Calendar!$A$3:$G$459,5,FALSE)),IF(C21=\"\",\"\",VLOOKUP(A21,Calendar!$A$3:$G$459,2,FALSE)))","v":"2019-09-13"},null,null,null,null,0,null,null,""]
[914,null,{"$f":"IF(ISNA(IF(Summary!$B$5=3,IF(VLOOKUP(A22,Calendar!$A$3:$G$459,7,FALSE)=\"S\", \"\", VLOOKUP(A22,Calendar!$A$3:$G$459,7,FALSE)),IF(VLOOKUP(A22,Calendar!$A$3:$G$459,4,FALSE)=\"S\", \"\", VLOOKUP(A22,Calendar!$A$3:$G$459,4,FALSE)))),\"\",IF(Summary!$B$5=3,IF(VLOOKUP(A22,Calendar!$A$3:$G$459,7,FALSE)=\"S\", \"\", VLOOKUP(A22,Calendar!$A$3:$G$459,7,FALSE)),IF(VLOOKUP(A22,Calendar!$A$3:$G$459,4,FALSE)=\"S\", \"\", VLOOKUP(A22,Calendar!$A$3:$G$459,4,FALSE))))","v":""},{"$f":"IF(Summary!$B$5=3,IF(C22=\"\",\"\",VLOOKUP(A22,Calendar!$A$3:$G$459,5,FALSE)),IF(C22=\"\",\"\",VLOOKUP(A22,Calendar!$A$3:$G$459,2,FALSE)))","v":""},null,null,null,null,0,null,null,""]
[915,null,{"$f":"IF(ISNA(IF(Summary!$B$5=3,IF(VLOOKUP(A23,Calendar!$A$3:$G$459,7,FALSE)=\"S\", \"\", VLOOKUP(A23,Calendar!$A$3:$G$459,7,FALSE)),IF(VLOOKUP(A23,Calendar!$A$3:$G$459,4,FALSE)=\"S\", \"\", VLOOKUP(A23,Calendar!$A$3:$G$459,4,FALSE)))),\"\",IF(Summary!$B$5=3,IF(VLOOKUP(A23,Calendar!$A$3:$G$459,7,FALSE)=\"S\", \"\", VLOOKUP(A23,Calendar!$A$3:$G$459,7,FALSE)),IF(VLOOKUP(A23,Calendar!$A$3:$G$459,4,FALSE)=\"S\", \"\", VLOOKUP(A23,Calendar!$A$3:$G$459,4,FALSE))))","v":""},{"$f":"IF(Summary!$B$5=3,IF(C23=\"\",\"\",VLOOKUP(A23,Calendar!$A$3:$G$459,5,FALSE)),IF(C23=\"\",\"\",VLOOKUP(A23,Calendar!$A$3:$G$459,2,FALSE)))","v":""},null,null,null,null,0,null,null,""]
[916,null,{"$f":"IF(ISNA(IF(Summary!$B$5=3,IF(VLOOKUP(A24,Calendar!$A$3:$G$459,7,FALSE)=\"S\", \"\", VLOOKUP(A24,Calendar!$A$3:$G$459,7,FALSE)),IF(VLOOKUP(A24,Calendar!$A$3:$G$459,4,FALSE)=\"S\", \"\", VLOOKUP(A24,Calendar!$A$3:$G$459,4,FALSE)))),\"\",IF(Summary!$B$5=3,IF(VLOOKUP(A24,Calendar!$A$3:$G$459,7,FALSE)=\"S\", \"\", VLOOKUP(A24,Calendar!$A$3:$G$459,7,FALSE)),IF(VLOOKUP(A24,Calendar!$A$3:$G$459,4,FALSE)=\"S\", \"\", VLOOKUP(A24,Calendar!$A$3:$G$459,4,FALSE))))","v":"M"},{"$f":"IF(Summary!$B$5=3,IF(C24=\"\",\"\",VLOOKUP(A24,Calendar!$A$3:$G$459,5,FALSE)),IF(C24=\"\",\"\",VLOOKUP(A24,Calendar!$A$3:$G$459,2,FALSE)))","v":"2019-09-16"},null,null,null,null,0,null,null,""]
[917,null,{"$f":"IF(ISNA(IF(Summary!$B$5=3,IF(VLOOKUP(A25,Calendar!$A$3:$G$459,7,FALSE)=\"S\", \"\", VLOOKUP(A25,Calendar!$A$3:$G$459,7,FALSE)),IF(VLOOKUP(A25,Calendar!$A$3:$G$459,4,FALSE)=\"S\", \"\", VLOOKUP(A25,Calendar!$A$3:$G$459,4,FALSE)))),\"\",IF(Summary!$B$5=3,IF(VLOOKUP(A25,Calendar!$A$3:$G$459,7,FALSE)=\"S\", \"\", VLOOKUP(A25,Calendar!$A$3:$G$459,7,FALSE)),IF(VLOOKUP(A25,Calendar!$A$3:$G$459,4,FALSE)=\"S\", \"\", VLOOKUP(A25,Calendar!$A$3:$G$459,4,FALSE))))","v":"T"},{"$f":"IF(Summary!$B$5=3,IF(C25=\"\",\"\",VLOOKUP(A25,Calendar!$A$3:$G$459,5,FALSE)),IF(C25=\"\",\"\",VLOOKUP(A25,Calendar!$A$3:$G$459,2,FALSE)))","v":"2019-09-17"},null,null,null,null,0,null,null,""]
[918,null,{"$f":"IF(ISNA(IF(Summary!$B$5=3,IF(VLOOKUP(A26,Calendar!$A$3:$G$459,7,FALSE)=\"S\", \"\", VLOOKUP(A26,Calendar!$A$3:$G$459,7,FALSE)),IF(VLOOKUP(A26,Calendar!$A$3:$G$459,4,FALSE)=\"S\", \"\", VLOOKUP(A26,Calendar!$A$3:$G$459,4,FALSE)))),\"\",IF(Summary!$B$5=3,IF(VLOOKUP(A26,Calendar!$A$3:$G$459,7,FALSE)=\"S\", \"\", VLOOKUP(A26,Calendar!$A$3:$G$459,7,FALSE)),IF(VLOOKUP(A26,Calendar!$A$3:$G$459,4,FALSE)=\"S\", \"\", VLOOKUP(A26,Calendar!$A$3:$G$459,4,FALSE))))","v":"W"},{"$f":"IF(Summary!$B$5=3,IF(C26=\"\",\"\",VLOOKUP(A26,Calendar!$A$3:$G$459,5,FALSE)),IF(C26=\"\",\"\",VLOOKUP(A26,Calendar!$A$3:$G$459,2,FALSE)))","v":"2019-09-18"},null,null,null,null,0,null,null,""]
[919,null,{"$f":"IF(ISNA(IF(Summary!$B$5=3,IF(VLOOKUP(A27,Calendar!$A$3:$G$459,7,FALSE)=\"S\", \"\", VLOOKUP(A27,Calendar!$A$3:$G$459,7,FALSE)),IF(VLOOKUP(A27,Calendar!$A$3:$G$459,4,FALSE)=\"S\", \"\", VLOOKUP(A27,Calendar!$A$3:$G$459,4,FALSE)))),\"\",IF(Summary!$B$5=3,IF(VLOOKUP(A27,Calendar!$A$3:$G$459,7,FALSE)=\"S\", \"\", VLOOKUP(A27,Calendar!$A$3:$G$459,7,FALSE)),IF(VLOOKUP(A27,Calendar!$A$3:$G$459,4,FALSE)=\"S\", \"\", VLOOKUP(A27,Calendar!$A$3:$G$459,4,FALSE))))","v":"R"},{"$f":"IF(Summary!$B$5=3,IF(C27=\"\",\"\",VLOOKUP(A27,Calendar!$A$3:$G$459,5,FALSE)),IF(C27=\"\",\"\",VLOOKUP(A27,Calendar!$A$3:$G$459,2,FALSE)))","v":"2019-09-19"},null,null,null,null,0,null,null,""]
[920,null,{"$f":"IF(ISNA(IF(Summary!$B$5=3,IF(VLOOKUP(A28,Calendar!$A$3:$G$459,7,FALSE)=\"S\", \"\", VLOOKUP(A28,Calendar!$A$3:$G$459,7,FALSE)),IF(VLOOKUP(A28,Calendar!$A$3:$G$459,4,FALSE)=\"S\", \"\", VLOOKUP(A28,Calendar!$A$3:$G$459,4,FALSE)))),\"\",IF(Summary!$B$5=3,IF(VLOOKUP(A28,Calendar!$A$3:$G$459,7,FALSE)=\"S\", \"\", VLOOKUP(A28,Calendar!$A$3:$G$459,7,FALSE)),IF(VLOOKUP(A28,Calendar!$A$3:$G$459,4,FALSE)=\"S\", \"\", VLOOKUP(A28,Calendar!$A$3:$G$459,4,FALSE))))","v":"F"},{"$f":"IF(Summary!$B$5=3,IF(C28=\"\",\"\",VLOOKUP(A28,Calendar!$A$3:$G$459,5,FALSE)),IF(C28=\"\",\"\",VLOOKUP(A28,Calendar!$A$3:$G$459,2,FALSE)))","v":"2019-09-20"},null,null,null,null,0,null,null,""]
[921,null,{"$f":"IF(ISNA(IF(Summary!$B$5=3,IF(VLOOKUP(A29,Calendar!$A$3:$G$459,7,FALSE)=\"S\", \"\", VLOOKUP(A29,Calendar!$A$3:$G$459,7,FALSE)),IF(VLOOKUP(A29,Calendar!$A$3:$G$459,4,FALSE)=\"S\", \"\", VLOOKUP(A29,Calendar!$A$3:$G$459,4,FALSE)))),\"\",IF(Summary!$B$5=3,IF(VLOOKUP(A29,Calendar!$A$3:$G$459,7,FALSE)=\"S\", \"\", VLOOKUP(A29,Calendar!$A$3:$G$459,7,FALSE)),IF(VLOOKUP(A29,Calendar!$A$3:$G$459,4,FALSE)=\"S\", \"\", VLOOKUP(A29,Calendar!$A$3:$G$459,4,FALSE))))","v":""},{"$f":"IF(Summary!$B$5=3,IF(C29=\"\",\"\",VLOOKUP(A29,Calendar!$A$3:$G$459,5,FALSE)),IF(C29=\"\",\"\",VLOOKUP(A29,Calendar!$A$3:$G$459,2,FALSE)))","v":""},null,null,null,null,0,null,null,""]
[922,null,{"$f":"IF(ISNA(IF(Summary!$B$5=3,IF(VLOOKUP(A30,Calendar!$A$3:$G$459,7,FALSE)=\"S\", \"\", VLOOKUP(A30,Calendar!$A$3:$G$459,7,FALSE)),IF(VLOOKUP(A30,Calendar!$A$3:$G$459,4,FALSE)=\"S\", \"\", VLOOKUP(A30,Calendar!$A$3:$G$459,4,FALSE)))),\"\",IF(Summary!$B$5=3,IF(VLOOKUP(A30,Calendar!$A$3:$G$459,7,FALSE)=\"S\", \"\", VLOOKUP(A30,Calendar!$A$3:$G$459,7,FALSE)),IF(VLOOKUP(A30,Calendar!$A$3:$G$459,4,FALSE)=\"S\", \"\", VLOOKUP(A30,Calendar!$A$3:$G$459,4,FALSE))))","v":""},{"$f":"IF(Summary!$B$5=3,IF(C30=\"\",\"\",VLOOKUP(A30,Calendar!$A$3:$G$459,5,FALSE)),IF(C30=\"\",\"\",VLOOKUP(A30,Calendar!$A$3:$G$459,2,FALSE)))","v":""},null,null,null,null,0,null,null,""]
[923,null,{"$f":"IF(ISNA(IF(Summary!$B$5=3,IF(VLOOKUP(A31,Calendar!$A$3:$G$459,7,FALSE)=\"S\", \"\", VLOOKUP(A31,Calendar!$A$3:$G$459,7,FALSE)),IF(VLOOKUP(A31,Calendar!$A$3:$G$459,4,FALSE)=\"S\", \"\", VLOOKUP(A31,Calendar!$A$3:$G$459,4,FALSE)))),\"\",IF(Summary!$B$5=3,IF(VLOOKUP(A31,Calendar!$A$3:$G$459,7,FALSE)=\"S\", \"\", VLOOKUP(A31,Calendar!$A$3:$G$459,7,FALSE)),IF(VLOOKUP(A31,Calendar!$A$3:$G$459,4,FALSE)=\"S\", \"\", VLOOKUP(A31,Calendar!$A$3:$G$459,4,FALSE))))","v":"M"},{"$f":"IF(Summary!$B$5=3,IF(C31=\"\",\"\",VLOOKUP(A31,Calendar!$A$3:$G$459,5,FALSE)),IF(C31=\"\",\"\",VLOOKUP(A31,Calendar!$A$3:$G$459,2,FALSE)))","v":"2019-09-23"},null,null,null,null,0,null,null,""]
[924,null,{"$f":"IF(ISNA(IF(Summary!$B$5=3,IF(VLOOKUP(A32,Calendar!$A$3:$G$459,7,FALSE)=\"S\", \"\", VLOOKUP(A32,Calendar!$A$3:$G$459,7,FALSE)),IF(VLOOKUP(A32,Calendar!$A$3:$G$459,4,FALSE)=\"S\", \"\", VLOOKUP(A32,Calendar!$A$3:$G$459,4,FALSE)))),\"\",IF(Summary!$B$5=3,IF(VLOOKUP(A32,Calendar!$A$3:$G$459,7,FALSE)=\"S\", \"\", VLOOKUP(A32,Calendar!$A$3:$G$459,7,FALSE)),IF(VLOOKUP(A32,Calendar!$A$3:$G$459,4,FALSE)=\"S\", \"\", VLOOKUP(A32,Calendar!$A$3:$G$459,4,FALSE))))","v":"T"},{"$f":"IF(Summary!$B$5=3,IF(C32=\"\",\"\",VLOOKUP(A32,Calendar!$A$3:$G$459,5,FALSE)),IF(C32=\"\",\"\",VLOOKUP(A32,Calendar!$A$3:$G$459,2,FALSE)))","v":"2019-09-24"},null,null,null,null,0,null,null,""]
[925,null,{"$f":"IF(ISNA(IF(Summary!$B$5=3,IF(VLOOKUP(A33,Calendar!$A$3:$G$459,7,FALSE)=\"S\", \"\", VLOOKUP(A33,Calendar!$A$3:$G$459,7,FALSE)),IF(VLOOKUP(A33,Calendar!$A$3:$G$459,4,FALSE)=\"S\", \"\", VLOOKUP(A33,Calendar!$A$3:$G$459,4,FALSE)))),\"\",IF(Summary!$B$5=3,IF(VLOOKUP(A33,Calendar!$A$3:$G$459,7,FALSE)=\"S\", \"\", VLOOKUP(A33,Calendar!$A$3:$G$459,7,FALSE)),IF(VLOOKUP(A33,Calendar!$A$3:$G$459,4,FALSE)=\"S\", \"\", VLOOKUP(A33,Calendar!$A$3:$G$459,4,FALSE))))","v":"W"},{"$f":"IF(Summary!$B$5=3,IF(C33=\"\",\"\",VLOOKUP(A33,Calendar!$A$3:$G$459,5,FALSE)),IF(C33=\"\",\"\",VLOOKUP(A33,Calendar!$A$3:$G$459,2,FALSE)))","v":"2019-09-25"},null,null,null,null,0,null,null,""]
[926,null,{"$f":"IF(ISNA(IF(Summary!$B$5=3,IF(VLOOKUP(A34,Calendar!$A$3:$G$459,7,FALSE)=\"S\", \"\", VLOOKUP(A34,Calendar!$A$3:$G$459,7,FALSE)),IF(VLOOKUP(A34,Calendar!$A$3:$G$459,4,FALSE)=\"S\", \"\", VLOOKUP(A34,Calendar!$A$3:$G$459,4,FALSE)))),\"\",IF(Summary!$B$5=3,IF(VLOOKUP(A34,Calendar!$A$3:$G$459,7,FALSE)=\"S\", \"\", VLOOKUP(A34,Calendar!$A$3:$G$459,7,FALSE)),IF(VLOOKUP(A34,Calendar!$A$3:$G$459,4,FALSE)=\"S\", \"\", VLOOKUP(A34,Calendar!$A$3:$G$459,4,FALSE))))","v":"R"},{"$f":"IF(Summary!$B$5=3,IF(C34=\"\",\"\",VLOOKUP(A34,Calendar!$A$3:$G$459,5,FALSE)),IF(C34=\"\",\"\",VLOOKUP(A34,Calendar!$A$3:$G$459,2,FALSE)))","v":"2019-09-26"},null,null,null,null,0,null,null,""]
[927,null,{"$f":"IF(ISNA(IF(Summary!$B$5=3,IF(VLOOKUP(A35,Calendar!$A$3:$G$459,7,FALSE)=\"S\", \"\", VLOOKUP(A35,Calendar!$A$3:$G$459,7,FALSE)),IF(VLOOKUP(A35,Calendar!$A$3:$G$459,4,FALSE)=\"S\", \"\", VLOOKUP(A35,Calendar!$A$3:$G$459,4,FALSE)))),\"\",IF(Summary!$B$5=3,IF(VLOOKUP(A35,Calendar!$A$3:$G$459,7,FALSE)=\"S\", \"\", VLOOKUP(A35,Calendar!$A$3:$G$459,7,FALSE)),IF(VLOOKUP(A35,Calendar!$A$3:$G$459,4,FALSE)=\"S\", \"\", VLOOKUP(A35,Calendar!$A$3:$G$459,4,FALSE))))","v":"F"},{"$f":"IF(Summary!$B$5=3,IF(C35=\"\",\"\",VLOOKUP(A35,Calendar!$A$3:$G$459,5,FALSE)),IF(C35=\"\",\"\",VLOOKUP(A35,Calendar!$A$3:$G$459,2,FALSE)))","v":"2019-09-27"},null,null,null,null,0,null,null,""]
[928,null,{"$f":"IF(ISNA(IF(Summary!$B$5=3,IF(VLOOKUP(A36,Calendar!$A$3:$G$459,7,FALSE)=\"S\", \"\", VLOOKUP(A36,Calendar!$A$3:$G$459,7,FALSE)),IF(VLOOKUP(A36,Calendar!$A$3:$G$459,4,FALSE)=\"S\", \"\", VLOOKUP(A36,Calendar!$A$3:$G$459,4,FALSE)))),\"\",IF(Summary!$B$5=3,IF(VLOOKUP(A36,Calendar!$A$3:$G$459,7,FALSE)=\"S\", \"\", VLOOKUP(A36,Calendar!$A$3:$G$459,7,FALSE)),IF(VLOOKUP(A36,Calendar!$A$3:$G$459,4,FALSE)=\"S\", \"\", VLOOKUP(A36,Calendar!$A$3:$G$459,4,FALSE))))","v":""},{"$f":"IF(Summary!$B$5=3,IF(C36=\"\",\"\",VLOOKUP(A36,Calendar!$A$3:$G$459,5,FALSE)),IF(C36=\"\",\"\",VLOOKUP(A36,Calendar!$A$3:$G$459,2,FALSE)))","v":""},null,null,null,null,0,null,null,""]
[929,null,{"$f":"IF(ISNA(IF(Summary!$B$5=3,IF(VLOOKUP(A37,Calendar!$A$3:$G$459,7,FALSE)=\"S\", \"\", VLOOKUP(A37,Calendar!$A$3:$G$459,7,FALSE)),IF(VLOOKUP(A37,Calendar!$A$3:$G$459,4,FALSE)=\"S\", \"\", VLOOKUP(A37,Calendar!$A$3:$G$459,4,FALSE)))),\"\",IF(Summary!$B$5=3,IF(VLOOKUP(A37,Calendar!$A$3:$G$459,7,FALSE)=\"S\", \"\", VLOOKUP(A37,Calendar!$A$3:$G$459,7,FALSE)),IF(VLOOKUP(A37,Calendar!$A$3:$G$459,4,FALSE)=\"S\", \"\", VLOOKUP(A37,Calendar!$A$3:$G$459,4,FALSE))))","v":""},{"$f":"IF(Summary!$B$5=3,IF(C37=\"\",\"\",VLOOKUP(A37,Calendar!$A$3:$G$459,5,FALSE)),IF(C37=\"\",\"\",VLOOKUP(A37,Calendar!$A$3:$G$459,2,FALSE)))","v":""},null,null,null,null,0,null,null,""]
[930,null,{"$f":"IF(ISNA(IF(Summary!$B$5=3,IF(VLOOKUP(A38,Calendar!$A$3:$G$459,7,FALSE)=\"S\", \"\", VLOOKUP(A38,Calendar!$A$3:$G$459,7,FALSE)),IF(VLOOKUP(A38,Calendar!$A$3:$G$459,4,FALSE)=\"S\", \"\", VLOOKUP(A38,Calendar!$A$3:$G$459,4,FALSE)))),\"\",IF(Summary!$B$5=3,IF(VLOOKUP(A38,Calendar!$A$3:$G$459,7,FALSE)=\"S\", \"\", VLOOKUP(A38,Calendar!$A$3:$G$459,7,FALSE)),IF(VLOOKUP(A38,Calendar!$A$3:$G$459,4,FALSE)=\"S\", \"\", VLOOKUP(A38,Calendar!$A$3:$G$459,4,FALSE))))","v":"M"},{"$f":"IF(Summary!$B$5=3,IF(C38=\"\",\"\",VLOOKUP(A38,Calendar!$A$3:$G$459,5,FALSE)),IF(C38=\"\",\"\",VLOOKUP(A38,Calendar!$A$3:$G$459,2,FALSE)))","v":"2019-09-30"},null,null,null,null,0,null,null,""]
[null,null,{"$f":"IF(ISNA(IF(Summary!$B$5=3,IF(VLOOKUP(A39,Calendar!$A$3:$G$459,7,FALSE)=\"S\", \"\", VLOOKUP(A39,Calendar!$A$3:$G$459,7,FALSE)),IF(VLOOKUP(A39,Calendar!$A$3:$G$459,4,FALSE)=\"S\", \"\", VLOOKUP(A39,Calendar!$A$3:$G$459,4,FALSE)))),\"\",IF(Summary!$B$5=3,IF(VLOOKUP(A39,Calendar!$A$3:$G$459,7,FALSE)=\"S\", \"\", VLOOKUP(A39,Calendar!$A$3:$G$459,7,FALSE)),IF(VLOOKUP(A39,Calendar!$A$3:$G$459,4,FALSE)=\"S\", \"\", VLOOKUP(A39,Calendar!$A$3:$G$459,4,FALSE))))","v":""},{"$f":"IF(Summary!$B$5=3,IF(C39=\"\",\"\",VLOOKUP(A39,Calendar!$A$3:$G$459,5,FALSE)),IF(C39=\"\",\"\",VLOOKUP(A39,Calendar!$A$3:$G$459,2,FALSE)))","v":""},null,null,null,null,0,null,null,""]
[null,null,null,"Total Minutes",{"$f":"SUM(E9:E39)","v":0},{"$f":"SUM(F9:F39)","v":0},0,0,0,null,null,{"$f":"IF(SUM(E40:H40)>COUNTA(E9:E39)*390,\"The sum total for all cost objectives exceeds the maximum anticipated value based upon the number of days worked. Confirm minutes claimed for each day.\",\"\")","v":""}]
[null,null,null,"Total Hours",{"$f":"E40/60","v":0},{"$f":"F40/60","v":0},0,0,0]
[]
[]
[null,null,"Notes"]
[]
[]
[]
[]
[]
[]
[]
[]
[]
[]
[null,null,null,null,"Kansas State Department of Education",null,null,null,"Personnel Activity Report"]
[null,null,null,null,"Fiscal Auditing",null,null,null,"Updated 9/20/18"]
[null,null,null,null,"785-296-4976"]
[null,null,null,null,"https://www.ksde.org/Agency/Fiscal-and-Administrative-Services/Fiscal-Auditing"]
[]
[]
[null,null,"The Kansas State Department of Education does not discriminate on the basis of race, color, national origin, sex, disability, or age in its programs and activities and provides equal access to the Boy Scouts and other designated youth groups. The following person has been designated to handle inquiries regarding the nondiscrimination policies: KSDE General Counsel, Office of General Counsel, KSDE, Landon State Office Building, 900 S.W. Jackson, Suite 102, Topeka, KS 66612, (785) 296-3204."]

{"sheet":"October","index":5,"n_rows":61,"n_cols":12,"rows_kept":61,"cut":false,"hidden":false,"merged":[[60,2,61,8],[1,2,1,8],[2,2,2,8],[3,2,3,8],[4,2,4,8],[46,2,46,8],[47,2,47,8],[48,2,48,8],[49,2,49,8],[5,2,5,8],[6,2,6,8],[43,3,43,8],[44,2,44,8],[45,2,45,8]]}
[]
[]
[null,null,"Personnel Activity Report"]
[null,null,"Regular School Year"]
[null,null,"October"]
[null,null,{"$f":"IF(Summary!$E$8<>\"\",Summary!$E$8,\" \")","v":" "}]
[null,null,{"$f":"IF(Summary!$E$9<>\"\",Summary!$E$9,\" \")","v":" "}]
[null,null,"Day","Date","Special Ed","General Ed","Other","Other","Totals",null,null,{"$f":"IF(OR(AND(F8=\"\",COUNTA(F9:F39)>0),AND(G8=\"\",COUNTA(G9:G39)>0),AND(H8=\"\",COUNTA(H9:H39)>0)),\"<<< You must identify the cost objective in the column heading.\",\"\")","v":""}]
[1001,null,{"$f":"IF(ISNA(IF(Summary!$B$5=3,IF(VLOOKUP(A9,Calendar!$A$3:$G$459,7,FALSE)=\"S\", \"\", VLOOKUP(A9,Calendar!$A$3:$G$459,7,FALSE)),IF(VLOOKUP(A9,Calendar!$A$3:$G$459,4,FALSE)=\"S\", \"\", VLOOKUP(A9,Calendar!$A$3:$G$459,4,FALSE)))),\"\",IF(Summary!$B$5=3,IF(VLOOKUP(A9,Calendar!$A$3:$G$459,7,FALSE)=\"S\", \"\", VLOOKUP(A9,Calendar!$A$3:$G$459,7,FALSE)),IF(VLOOKUP(A9,Calendar!$A$3:$G$459,4,FALSE)=\"S\", \"\", VLOOKUP(A9,Calendar!$A$3:$G$459,4,FALSE))))","v":"T"},{"$f":"IF(Summary!$B$5=3,IF(C9=\"\",\"\",VLOOKUP(A9,Calendar!$A$3:$G$459,5,FALSE)),IF(C9=\"\",\"\",VLOOKUP(A9,Calendar!$A$3:$G$459,2,FALSE)))","v":"2019-10-01"},null,null,null,null,{"$f":"MIN(1440,SUM(E9:H9))","v":0},null,null,{"$f":"IF(I9>390, \"<<< Day exceeds 390 minutes. Confirm reported time.\",\"\")","v":""}]
[1002,null,{"$f":"IF(ISNA(IF(Summary!$B$5=3,IF(VLOOKUP(A10,Calendar!$A$3:$G$459,7,FALSE)=\"S\", \"\", VLOOKUP(A10,Calendar!$A$3:$G$459,7,FALSE)),IF(VLOOKUP(A10,Calendar!$A$3:$G$459,4,FALSE)=\"S\", \"\", VLOOKUP(A10,Calendar!$A$3:$G$459,4,FALSE)))),\"\",IF(Summary!$B$5=3,IF(VLOOKUP(A10,Calendar!$A$3:$G$459,7,FALSE)=\"S\", \"\", VLOOKUP(A10,Calendar!$A$3:$G$459,7,FALSE)),IF(VLOOKUP(A10,Calendar!$A$3:$G$459,4,FALSE)=\"S\", \"\", VLOOKUP(A10,Calendar!$A$3:$G$459,4,FALSE))))","v":"W"},{"$f":"IF(Summary!$B$5=3,IF(C10=\"\",\"\",VLOOKUP(A10,Calendar!$A$3:$G$459,5,FALSE)),IF(C10=\"\",\"\",VLOOKUP(A10,Calendar!$A$3:$G$459,2,FALSE)))","v":"2019-10-02"},null,null,null,null,{"$f":"MIN(1440,SUM(E10:H10))","v":0},null,null,{"$f":"IF(I10>390, \"<<< Day exceeds 390 minutes. Confirm reported time.\",\"\")","v":""}]
[1003,null,{"$f":"IF(ISNA(IF(Summary!$B$5=3,IF(VLOOKUP(A11,Calendar!$A$3:$G$459,7,FALSE)=\"S\", \"\", VLOOKUP(A11,Calendar!$A$3:$G$459,7,FALSE)),IF(VLOOKUP(A11,Calendar!$A$3:$G$459,4,FALSE)=\"S\", \"\", VLOOKUP(A11,Calendar!$A$3:$G$459,4,FALSE)))),\"\",IF(Summary!$B$5=3,IF(VLOOKUP(A11,Calendar!$A$3:$G$459,7,FALSE)=\"S\", \"\", VLOOKUP(A11,Calendar!$A$3:$G$459,7,FALSE)),IF(VLOOKUP(A11,Calendar!$A$3:$G$459,4,FALSE)=\"S\", \"\", VLOOKUP(A11,Calendar!$A$3:$G$459,4,FALSE))))","v":"R"},{"$f":"IF(Summary!$B$5=3,IF(C11=\"\",\"\",VLOOKUP(A11,Calendar!$A$3:$G$459,5,FALSE)),IF(C11=\"\",\"\",VLOOKUP(A11,Calendar!$A$3:$G$459,2,FALSE)))","v":"2019-10-03"},null,null,null,null,0,null,null,""]
[1004,null,{"$f":"IF(ISNA(IF(Summary!$B$5=3,IF(VLOOKUP(A12,Calendar!$A$3:$G$459,7,FALSE)=\"S\", \"\", VLOOKUP(A12,Calendar!$A$3:$G$459,7,FALSE)),IF(VLOOKUP(A12,Calendar!$A$3:$G$459,4,FALSE)=\"S\", \"\", VLOOKUP(A12,Calendar!$A$3:$G$459,4,FALSE)))),\"\",IF(Summary!$B$5=3,IF(VLOOKUP(A12,Calendar!$A$3:$G$459,7,FALSE)=\"S\", \"\", VLOOKUP(A12,Calendar!$A$3:$G$459,7,FALSE)),IF(VLOOKUP(A12,Calendar!$A$3:$G$459,4,FALSE)=\"S\", \"\", VLOOKUP(A12,Calendar!$A$3:$G$459,4,FALSE))))","v":"F"},{"$f":"IF(Summary!$B$5=3,IF(C12=\"\",\"\",VLOOKUP(A12,Calendar!$A$3:$G$459,5,FALSE)),IF(C12=\"\",\"\",VLOOKUP(A12,Calendar!$A$3:$G$459,2,FALSE)))","v":"2019-10-04"},null,null,null,null,0,null,null,""]
[1005,null,{"$f":"IF(ISNA(IF(Summary!$B$5=3,IF(VLOOKUP(A13,Calendar!$A$3:$G$459,7,FALSE)=\"S\", \"\", VLOOKUP(A13,Calendar!$A$3:$G$459,7,FALSE)),IF(VLOOKUP(A13,Calendar!$A$3:$G$459,4,FALSE)=\"S\", \"\", VLOOKUP(A13,Calendar!$A$3:$G$459,4,FALSE)))),\"\",IF(Summary!$B$5=3,IF(VLOOKUP(A13,Calendar!$A$3:$G$459,7,FALSE)=\"S\", \"\", VLOOKUP(A13,Calendar!$A$3:$G$459,7,FALSE)),IF(VLOOKUP(A13,Calendar!$A$3:$G$459,4,FALSE)=\"S\", \"\", VLOOKUP(A13,Calendar!$A$3:$G$459,4,FALSE))))","v":""},{"$f":"IF(Summary!$B$5=3,IF(C13=\"\",\"\",VLOOKUP(A13,Calendar!$A$3:$G$459,5,FALSE)),IF(C13=\"\",\"\",VLOOKUP(A13,Calendar!$A$3:$G$459,2,FALSE)))","v":""},null,null,null,null,0,null,null,""]
[1006,null,{"$f":"IF(ISNA(IF(Summary!$B$5=3,IF(VLOOKUP(A14,Calendar!$A$3:$G$459,7,FALSE)=\"S\", \"\", VLOOKUP(A14,Calendar!$A$3:$G$459,7,FALSE)),IF(VLOOKUP(A14,Calendar!$A$3:$G$459,4,FALSE)=\"S\", \"\", VLOOKUP(A14,Calendar!$A$3:$G$459,4,FALSE)))),\"\",IF(Summary!$B$5=3,IF(VLOOKUP(A14,Calendar!$A$3:$G$459,7,FALSE)=\"S\", \"\", VLOOKUP(A14,Calendar!$A$3:$G$459,7,FALSE)),IF(VLOOKUP(A14,Calendar!$A$3:$G$459,4,FALSE)=\"S\", \"\", VLOOKUP(A14,Calendar!$A$3:$G$459,4,FALSE))))","v":""},{"$f":"IF(Summary!$B$5=3,IF(C14=\"\",\"\",VLOOKUP(A14,Calendar!$A$3:$G$459,5,FALSE)),IF(C14=\"\",\"\",VLOOKUP(A14,Calendar!$A$3:$G$459,2,FALSE)))","v":""},null,null,null,null,0,null,null,""]
[1007,null,{"$f":"IF(ISNA(IF(Summary!$B$5=3,IF(VLOOKUP(A15,Calendar!$A$3:$G$459,7,FALSE)=\"S\", \"\", VLOOKUP(A15,Calendar!$A$3:$G$459,7,FALSE)),IF(VLOOKUP(A15,Calendar!$A$3:$G$459,4,FALSE)=\"S\", \"\", VLOOKUP(A15,Calendar!$A$3:$G$459,4,FALSE)))),\"\",IF(Summary!$B$5=3,IF(VLOOKUP(A15,Calendar!$A$3:$G$459,7,FALSE)=\"S\", \"\", VLOOKUP(A15,Calendar!$A$3:$G$459,7,FALSE)),IF(VLOOKUP(A15,Calendar!$A$3:$G$459,4,FALSE)=\"S\", \"\", VLOOKUP(A15,Calendar!$A$3:$G$459,4,FALSE))))","v":"M"},{"$f":"IF(Summary!$B$5=3,IF(C15=\"\",\"\",VLOOKUP(A15,Calendar!$A$3:$G$459,5,FALSE)),IF(C15=\"\",\"\",VLOOKUP(A15,Calendar!$A$3:$G$459,2,FALSE)))","v":"2019-10-07"},null,null,null,null,0,null,null,""]
[1008,null,{"$f":"IF(ISNA(IF(Summary!$B$5=3,IF(VLOOKUP(A16,Calendar!$A$3:$G$459,7,FALSE)=\"S\", \"\", VLOOKUP(A16,Calendar!$A$3:$G$459,7,FALSE)),IF(VLOOKUP(A16,Calendar!$A$3:$G$459,4,FALSE)=\"S\", \"\", VLOOKUP(A16,Calendar!$A$3:$G$459,4,FALSE)))),\"\",IF(Summary!$B$5=3,IF(VLOOKUP(A16,Calendar!$A$3:$G$459,7,FALSE)=\"S\", \"\", VLOOKUP(A16,Calendar!$A$3:$G$459,7,FALSE)),IF(VLOOKUP(A16,Calendar!$A$3:$G$459,4,FALSE)=\"S\", \"\", VLOOKUP(A16,Calendar!$A$3:$G$459,4,FALSE))))","v":"T"},{"$f":"IF(Summary!$B$5=3,IF(C16=\"\",\"\",VLOOKUP(A16,Calendar!$A$3:$G$459,5,FALSE)),IF(C16=\"\",\"\",VLOOKUP(A16,Calendar!$A$3:$G$459,2,FALSE)))","v":"2019-10-08"},null,null,null,null,0,null,null,""]
[1009,null,{"$f":"IF(ISNA(IF(Summary!$B$5=3,IF(VLOOKUP(A17,Calendar!$A$3:$G$459,7,FALSE)=\"S\", \"\", VLOOKUP(A17,Calendar!$A$3:$G$459,7,FALSE)),IF(VLOOKUP(A17,Calendar!$A$3:$G$459,4,FALSE)=\"S\", \"\", VLOOKUP(A17,Calendar!$A$3:$G$459,4,FALSE)))),\"\",IF(Summary!$B$5=3,IF(VLOOKUP(A17,Calendar!$A$3:$G$459,7,FALSE)=\"S\", \"\", VLOOKUP(A17,Calendar!$A$3:$G$459,7,FALSE)),IF(VLOOKUP(A17,Calendar!$A$3:$G$459,4,FALSE)=\"S\", \"\", VLOOKUP(A17,Calendar!$A$3:$G$459,4,FALSE))))","v":"W"},{"$f":"IF(Summary!$B$5=3,IF(C17=\"\",\"\",VLOOKUP(A17,Calendar!$A$3:$G$459,5,FALSE)),IF(C17=\"\",\"\",VLOOKUP(A17,Calendar!$A$3:$G$459,2,FALSE)))","v":"2019-10-09"},null,null,null,null,0,null,null,""]
[1010,null,{"$f":"IF(ISNA(IF(Summary!$B$5=3,IF(VLOOKUP(A18,Calendar!$A$3:$G$459,7,FALSE)=\"S\", \"\", VLOOKUP(A18,Calendar!$A$3:$G$459,7,FALSE)),IF(VLOOKUP(A18,Calendar!$A$3:$G$459,4,FALSE)=\"S\", \"\", VLOOKUP(A18,Calendar!$A$3:$G$459,4,FALSE)))),\"\",IF(Summary!$B$5=3,IF(VLOOKUP(A18,Calendar!$A$3:$G$459,7,FALSE)=\"S\", \"\", VLOOKUP(A18,Calendar!$A$3:$G$459,7,FALSE)),IF(VLOOKUP(A18,Calendar!$A$3:$G$459,4,FALSE)=\"S\", \"\", VLOOKUP(A18,Calendar!$A$3:$G$459,4,FALSE))))","v":"R"},{"$f":"IF(Summary!$B$5=3,IF(C18=\"\",\"\",VLOOKUP(A18,Calendar!$A$3:$G$459,5,FALSE)),IF(C18=\"\",\"\",VLOOKUP(A18,Calendar!$A$3:$G$459,2,FALSE)))","v":"2019-10-10"},null,null,null,null,0,null,null,""]
[1011,null,{"$f":"IF(ISNA(IF(Summary!$B$5=3,IF(VLOOKUP(A19,Calendar!$A$3:$G$459,7,FALSE)=\"S\", \"\", VLOOKUP(A19,Calendar!$A$3:$G$459,7,FALSE)),IF(VLOOKUP(A19,Calendar!$A$3:$G$459,4,FALSE)=\"S\", \"\", VLOOKUP(A19,Calendar!$A$3:$G$459,4,FALSE)))),\"\",IF(Summary!$B$5=3,IF(VLOOKUP(A19,Calendar!$A$3:$G$459,7,FALSE)=\"S\", \"\", VLOOKUP(A19,Calendar!$A$3:$G$459,7,FALSE)),IF(VLOOKUP(A19,Calendar!$A$3:$G$459,4,FALSE)=\"S\", \"\", VLOOKUP(A19,Calendar!$A$3:$G$459,4,FALSE))))","v":"F"},{"$f":"IF(Summary!$B$5=3,IF(C19=\"\",\"\",VLOOKUP(A19,Calendar!$A$3:$G$459,5,FALSE)),IF(C19=\"\",\"\",VLOOKUP(A19,Calendar!$A$3:$G$459,2,FALSE)))","v":"2019-10-11"},null,null,null,null,0,null,null,""]
[1012,null,{"$f":"IF(ISNA(IF(Summary!$B$5=3,IF(VLOOKUP(A20,Calendar!$A$3:$G$459,7,FALSE)=\"S\", \"\", VLOOKUP(A20,Calendar!$A$3:$G$459,7,FALSE)),IF(VLOOKUP(A20,Calendar!$A$3:$G$459,4,FALSE)=\"S\", \"\", VLOOKUP(A20,Calendar!$A$3:$G$459,4,FALSE)))),\"\",IF(Summary!$B$5=3,IF(VLOOKUP(A20,Calendar!$A$3:$G$459,7,FALSE)=\"S\", \"\", VLOOKUP(A20,Calendar!$A$3:$G$459,7,FALSE)),IF(VLOOKUP(A20,Calendar!$A$3:$G$459,4,FALSE)=\"S\", \"\", VLOOKUP(A20,Calendar!$A$3:$G$459,4,FALSE))))","v":""},{"$f":"IF(Summary!$B$5=3,IF(C20=\"\",\"\",VLOOKUP(A20,Calendar!$A$3:$G$459,5,FALSE)),IF(C20=\"\",\"\",VLOOKUP(A20,Calendar!$A$3:$G$459,2,FALSE)))","v":""},null,null,null,null,0,null,null,""]
[1013,null,{"$f":"IF(ISNA(IF(Summary!$B$5=3,IF(VLOOKUP(A21,Calendar!$A$3:$G$459,7,FALSE)=\"S\", \"\", VLOOKUP(A21,Calendar!$A$3:$G$459,7,FALSE)),IF(VLOOKUP(A21,Calendar!$A$3:$G$459,4,FALSE)=\"S\", \"\", VLOOKUP(A21,Calendar!$A$3:$G$459,4,FALSE)))),\"\",IF(Summary!$B$5=3,IF(VLOOKUP(A21,Calendar!$A$3:$G$459,7,FALSE)=\"S\", \"\", VLOOKUP(A21,Calendar!$A$3:$G$459,7,FALSE)),IF(VLOOKUP(A21,Calendar!$A$3:$G$459,4,FALSE)=\"S\", \"\", VLOOKUP(A21,Calendar!$A$3:$G$459,4,FALSE))))","v":""},{"$f":"IF(Summary!$B$5=3,IF(C21=\"\",\"\",VLOOKUP(A21,Calendar!$A$3:$G$459,5,FALSE)),IF(C21=\"\",\"\",VLOOKUP(A21,Calendar!$A$3:$G$459,2,FALSE)))","v":""},null,null,null,null,0,null,null,""]
[1014,null,{"$f":"IF(ISNA(IF(Summary!$B$5=3,IF(VLOOKUP(A22,Calendar!$A$3:$G$459,7,FALSE)=\"S\", \"\", VLOOKUP(A22,Calendar!$A$3:$G$459,7,FALSE)),IF(VLOOKUP(A22,Calendar!$A$3:$G$459,4,FALSE)=\"S\", \"\", VLOOKUP(A22,Calendar!$A$3:$G$459,4,FALSE)))),\"\",IF(Summary!$B$5=3,IF(VLOOKUP(A22,Calendar!$A$3:$G$459,7,FALSE)=\"S\", \"\", VLOOKUP(A22,Calendar!$A$3:$G$459,7,FALSE)),IF(VLOOKUP(A22,Calendar!$A$3:$G$459,4,FALSE)=\"S\", \"\", VLOOKUP(A22,Calendar!$A$3:$G$459,4,FALSE))))","v":"M"},{"$f":"IF(Summary!$B$5=3,IF(C22=\"\",\"\",VLOOKUP(A22,Calendar!$A$3:$G$459,5,FALSE)),IF(C22=\"\",\"\",VLOOKUP(A22,Calendar!$A$3:$G$459,2,FALSE)))","v":"2019-10-14"},null,null,null,null,0,null,null,""]
[1015,null,{"$f":"IF(ISNA(IF(Summary!$B$5=3,IF(VLOOKUP(A23,Calendar!$A$3:$G$459,7,FALSE)=\"S\", \"\", VLOOKUP(A23,Calendar!$A$3:$G$459,7,FALSE)),IF(VLOOKUP(A23,Calendar!$A$3:$G$459,4,FALSE)=\"S\", \"\", VLOOKUP(A23,Calendar!$A$3:$G$459,4,FALSE)))),\"\",IF(Summary!$B$5=3,IF(VLOOKUP(A23,Calendar!$A$3:$G$459,7,FALSE)=\"S\", \"\", VLOOKUP(A23,Calendar!$A$3:$G$459,7,FALSE)),IF(VLOOKUP(A23,Calendar!$A$3:$G$459,4,FALSE)=\"S\", \"\", VLOOKUP(A23,Calendar!$A$3:$G$459,4,FALSE))))","v":"T"},{"$f":"IF(Summary!$B$5=3,IF(C23=\"\",\"\",VLOOKUP(A23,Calendar!$A$3:$G$459,5,FALSE)),IF(C23=\"\",\"\",VLOOKUP(A23,Calendar!$A$3:$G$459,2,FALSE)))","v":"2019-10-15"},null,null,null,null,0,null,null,""]
[1016,null,{"$f":"IF(ISNA(IF(Summary!$B$5=3,IF(VLOOKUP(A24,Calendar!$A$3:$G$459,7,FALSE)=\"S\", \"\", VLOOKUP(A24,Calendar!$A$3:$G$459,7,FALSE)),IF(VLOOKUP(A24,Calendar!$A$3:$G$459,4,FALSE)=\"S\", \"\", VLOOKUP(A24,Calendar!$A$3:$G$459,4,FALSE)))),\"\",IF(Summary!$B$5=3,IF(VLOOKUP(A24,Calendar!$A$3:$G$459,7,FALSE)=\"S\", \"\", VLOOKUP(A24,Calendar!$A$3:$G$459,7,FALSE)),IF(VLOOKUP(A24,Calendar!$A$3:$G$459,4,FALSE)=\"S\", \"\", VLOOKUP(A24,Calendar!$A$3:$G$459,4,FALSE))))","v":"W"},{"$f":"IF(Summary!$B$5=3,IF(C24=\"\",\"\",VLOOKUP(A24,Calendar!$A$3:$G$459,5,FALSE)),IF(C24=\"\",\"\",VLOOKUP(A24,Calendar!$A$3:$G$459,2,FALSE)))","v":"2019-10-16"},null,null,null,null,0,null,null,""]
[1017,null,{"$f":"IF(ISNA(IF(Summary!$B$5=3,IF(VLOOKUP(A25,Calendar!$A$3:$G$459,7,FALSE)=\"S\", \"\", VLOOKUP(A25,Calendar!$A$3:$G$459,7,FALSE)),IF(VLOOKUP(A25,Calendar!$A$3:$G$459,4,FALSE)=\"S\", \"\", VLOOKUP(A25,Calendar!$A$3:$G$459,4,FALSE)))),\"\",IF(Summary!$B$5=3,IF(VLOOKUP(A25,Calendar!$A$3:$G$459,7,FALSE)=\"S\", \"\", VLOOKUP(A25,Calendar!$A$3:$G$459,7,FALSE)),IF(VLOOKUP(A25,Calendar!$A$3:$G$459,4,FALSE)=\"S\", \"\", VLOOKUP(A25,Calendar!$A$3:$G$459,4,FALSE))))","v":"R"},{"$f":"IF(Summary!$B$5=3,IF(C25=\"\",\"\",VLOOKUP(A25,Calendar!$A$3:$G$459,5,FALSE)),IF(C25=\"\",\"\",VLOOKUP(A25,Calendar!$A$3:$G$459,2,FALSE)))","v":"2019-10-17"},null,null,null,null,0,null,null,""]
[1018,null,{"$f":"IF(ISNA(IF(Summary!$B$5=3,IF(VLOOKUP(A26,Calendar!$A$3:$G$459,7,FALSE)=\"S\", \"\", VLOOKUP(A26,Calendar!$A$3:$G$459,7,FALSE)),IF(VLOOKUP(A26,Calendar!$A$3:$G$459,4,FALSE)=\"S\", \"\", VLOOKUP(A26,Calendar!$A$3:$G$459,4,FALSE)))),\"\",IF(Summary!$B$5=3,IF(VLOOKUP(A26,Calendar!$A$3:$G$459,7,FALSE)=\"S\", \"\", VLOOKUP(A26,Calendar!$A$3:$G$459,7,FALSE)),IF(VLOOKUP(A26,Calendar!$A$3:$G$459,4,FALSE)=\"S\", \"\", VLOOKUP(A26,Calendar!$A$3:$G$459,4,FALSE))))","v":"F"},{"$f":"IF(Summary!$B$5=3,IF(C26=\"\",\"\",VLOOKUP(A26,Calendar!$A$3:$G$459,5,FALSE)),IF(C26=\"\",\"\",VLOOKUP(A26,Calendar!$A$3:$G$459,2,FALSE)))","v":"2019-10-18"},null,null,null,null,0,null,null,""]
[1019,null,{"$f":"IF(ISNA(IF(Summary!$B$5=3,IF(VLOOKUP(A27,Calendar!$A$3:$G$459,7,FALSE)=\"S\", \"\", VLOOKUP(A27,Calendar!$A$3:$G$459,7,FALSE)),IF(VLOOKUP(A27,Calendar!$A$3:$G$459,4,FALSE)=\"S\", \"\", VLOOKUP(A27,Calendar!$A$3:$G$459,4,FALSE)))),\"\",IF(Summary!$B$5=3,IF(VLOOKUP(A27,Calendar!$A$3:$G$459,7,FALSE)=\"S\", \"\", VLOOKUP(A27,Calendar!$A$3:$G$459,7,FALSE)),IF(VLOOKUP(A27,Calendar!$A$3:$G$459,4,FALSE)=\"S\", \"\", VLOOKUP(A27,Calendar!$A$3:$G$459,4,FALSE))))","v":""},{"$f":"IF(Summary!$B$5=3,IF(C27=\"\",\"\",VLOOKUP(A27,Calendar!$A$3:$G$459,5,FALSE)),IF(C27=\"\",\"\",VLOOKUP(A27,Calendar!$A$3:$G$459,2,FALSE)))","v":""},null,null,null,null,0,null,null,""]
[1020,null,{"$f":"IF(ISNA(IF(Summary!$B$5=3,IF(VLOOKUP(A28,Calendar!$A$3:$G$459,7,FALSE)=\"S\", \"\", VLOOKUP(A28,Calendar!$A$3:$G$459,7,FALSE)),IF(VLOOKUP(A28,Calendar!$A$3:$G$459,4,FALSE)=\"S\", \"\", VLOOKUP(A28,Calendar!$A$3:$G$459,4,FALSE)))),\"\",IF(Summary!$B$5=3,IF(VLOOKUP(A28,Calendar!$A$3:$G$459,7,FALSE)=\"S\", \"\", VLOOKUP(A28,Calendar!$A$3:$G$459,7,FALSE)),IF(VLOOKUP(A28,Calendar!$A$3:$G$459,4,FALSE)=\"S\", \"\", VLOOKUP(A28,Calendar!$A$3:$G$459,4,FALSE))))","v":""},{"$f":"IF(Summary!$B$5=3,IF(C28=\"\",\"\",VLOOKUP(A28,Calendar!$A$3:$G$459,5,FALSE)),IF(C28=\"\",\"\",VLOOKUP(A28,Calendar!$A$3:$G$459,2,FALSE)))","v":""},null,null,null,null,0,null,null,""]
[1021,null,{"$f":"IF(ISNA(IF(Summary!$B$5=3,IF(VLOOKUP(A29,Calendar!$A$3:$G$459,7,FALSE)=\"S\", \"\", VLOOKUP(A29,Calendar!$A$3:$G$459,7,FALSE)),IF(VLOOKUP(A29,Calendar!$A$3:$G$459,4,FALSE)=\"S\", \"\", VLOOKUP(A29,Calendar!$A$3:$G$459,4,FALSE)))),\"\",IF(Summary!$B$5=3,IF(VLOOKUP(A29,Calendar!$A$3:$G$459,7,FALSE)=\"S\", \"\", VLOOKUP(A29,Calendar!$A$3:$G$459,7,FALSE)),IF(VLOOKUP(A29,Calendar!$A$3:$G$459,4,FALSE)=\"S\", \"\", VLOOKUP(A29,Calendar!$A$3:$G$459,4,FALSE))))","v":"M"},{"$f":"IF(Summary!$B$5=3,IF(C29=\"\",\"\",VLOOKUP(A29,Calendar!$A$3:$G$459,5,FALSE)),IF(C29=\"\",\"\",VLOOKUP(A29,Calendar!$A$3:$G$459,2,FALSE)))","v":"2019-10-21"},null,null,null,null,0,null,null,""]
[1022,null,{"$f":"IF(ISNA(IF(Summary!$B$5=3,IF(VLOOKUP(A30,Calendar!$A$3:$G$459,7,FALSE)=\"S\", \"\", VLOOKUP(A30,Calendar!$A$3:$G$459,7,FALSE)),IF(VLOOKUP(A30,Calendar!$A$3:$G$459,4,FALSE)=\"S\", \"\", VLOOKUP(A30,Calendar!$A$3:$G$459,4,FALSE)))),\"\",IF(Summary!$B$5=3,IF(VLOOKUP(A30,Calendar!$A$3:$G$459,7,FALSE)=\"S\", \"\", VLOOKUP(A30,Calendar!$A$3:$G$459,7,FALSE)),IF(VLOOKUP(A30,Calendar!$A$3:$G$459,4,FALSE)=\"S\", \"\", VLOOKUP(A30,Calendar!$A$3:$G$459,4,FALSE))))","v":"T"},{"$f":"IF(Summary!$B$5=3,IF(C30=\"\",\"\",VLOOKUP(A30,Calendar!$A$3:$G$459,5,FALSE)),IF(C30=\"\",\"\",VLOOKUP(A30,Calendar!$A$3:$G$459,2,FALSE)))","v":"2019-10-22"},null,null,null,null,0,null,null,""]
[1023,null,{"$f":"IF(ISNA(IF(Summary!$B$5=3,IF(VLOOKUP(A31,Calendar!$A$3:$G$459,7,FALSE)=\"S\", \"\", VLOOKUP(A31,Calendar!$A$3:$G$459,7,FALSE)),IF(VLOOKUP(A31,Calendar!$A$3:$G$459,4,FALSE)=\"S\", \"\", VLOOKUP(A31,Calendar!$A$3:$G$459,4,FALSE)))),\"\",IF(Summary!$B$5=3,IF(VLOOKUP(A31,Calendar!$A$3:$G$459,7,FALSE)=\"S\", \"\", VLOOKUP(A31,Calendar!$A$3:$G$459,7,FALSE)),IF(VLOOKUP(A31,Calendar!$A$3:$G$459,4,FALSE)=\"S\", \"\", VLOOKUP(A31,Calendar!$A$3:$G$459,4,FALSE))))","v":"W"},{"$f":"IF(Summary!$B$5=3,IF(C31=\"\",\"\",VLOOKUP(A31,Calendar!$A$3:$G$459,5,FALSE)),IF(C31=\"\",\"\",VLOOKUP(A31,Calendar!$A$3:$G$459,2,FALSE)))","v":"2019-10-23"},null,null,null,null,0,null,null,""]
[1024,null,{"$f":"IF(ISNA(IF(Summary!$B$5=3,IF(VLOOKUP(A32,Calendar!$A$3:$G$459,7,FALSE)=\"S\", \"\", VLOOKUP(A32,Calendar!$A$3:$G$459,7,FALSE)),IF(VLOOKUP(A32,Calendar!$A$3:$G$459,4,FALSE)=\"S\", \"\", VLOOKUP(A32,Calendar!$A$3:$G$459,4,FALSE)))),\"\",IF(Summary!$B$5=3,IF(VLOOKUP(A32,Calendar!$A$3:$G$459,7,FALSE)=\"S\", \"\", VLOOKUP(A32,Calendar!$A$3:$G$459,7,FALSE)),IF(VLOOKUP(A32,Calendar!$A$3:$G$459,4,FALSE)=\"S\", \"\", VLOOKUP(A32,Calendar!$A$3:$G$459,4,FALSE))))","v":"R"},{"$f":"IF(Summary!$B$5=3,IF(C32=\"\",\"\",VLOOKUP(A32,Calendar!$A$3:$G$459,5,FALSE)),IF(C32=\"\",\"\",VLOOKUP(A32,Calendar!$A$3:$G$459,2,FALSE)))","v":"2019-10-24"},null,null,null,null,0,null,null,""]
[1025,null,{"$f":"IF(ISNA(IF(Summary!$B$5=3,IF(VLOOKUP(A33,Calendar!$A$3:$G$459,7,FALSE)=\"S\", \"\", VLOOKUP(A33,Calendar!$A$3:$G$459,7,FALSE)),IF(VLOOKUP(A33,Calendar!$A$3:$G$459,4,FALSE)=\"S\", \"\", VLOOKUP(A33,Calendar!$A$3:$G$459,4,FALSE)))),\"\",IF(Summary!$B$5=3,IF(VLOOKUP(A33,Calendar!$A$3:$G$459,7,FALSE)=\"S\", \"\", VLOOKUP(A33,Calendar!$A$3:$G$459,7,FALSE)),IF(VLOOKUP(A33,Calendar!$A$3:$G$459,4,FALSE)=\"S\", \"\", VLOOKUP(A33,Calendar!$A$3:$G$459,4,FALSE))))","v":"F"},{"$f":"IF(Summary!$B$5=3,IF(C33=\"\",\"\",VLOOKUP(A33,Calendar!$A$3:$G$459,5,FALSE)),IF(C33=\"\",\"\",VLOOKUP(A33,Calendar!$A$3:$G$459,2,FALSE)))","v":"2019-10-25"},null,null,null,null,0,null,null,""]
[1026,null,{"$f":"IF(ISNA(IF(Summary!$B$5=3,IF(VLOOKUP(A34,Calendar!$A$3:$G$459,7,FALSE)=\"S\", \"\", VLOOKUP(A34,Calendar!$A$3:$G$459,7,FALSE)),IF(VLOOKUP(A34,Calendar!$A$3:$G$459,4,FALSE)=\"S\", \"\", VLOOKUP(A34,Calendar!$A$3:$G$459,4,FALSE)))),\"\",IF(Summary!$B$5=3,IF(VLOOKUP(A34,Calendar!$A$3:$G$459,7,FALSE)=\"S\", \"\", VLOOKUP(A34,Calendar!$A$3:$G$459,7,FALSE)),IF(VLOOKUP(A34,Calendar!$A$3:$G$459,4,FALSE)=\"S\", \"\", VLOOKUP(A34,Calendar!$A$3:$G$459,4,FALSE))))","v":""},{"$f":"IF(Summary!$B$5=3,IF(C34=\"\",\"\",VLOOKUP(A34,Calendar!$A$3:$G$459,5,FALSE)),IF(C34=\"\",\"\",VLOOKUP(A34,Calendar!$A$3:$G$459,2,FALSE)))","v":""},null,null,null,null,0,null,null,""]
[1027,null,{"$f":"IF(ISNA(IF(Summary!$B$5=3,IF(VLOOKUP(A35,Calendar!$A$3:$G$459,7,FALSE)=\"S\", \"\", VLOOKUP(A35,Calendar!$A$3:$G$459,7,FALSE)),IF(VLOOKUP(A35,Calendar!$A$3:$G$459,4,FALSE)=\"S\", \"\", VLOOKUP(A35,Calendar!$A$3:$G$459,4,FALSE)))),\"\",IF(Summary!$B$5=3,IF(VLOOKUP(A35,Calendar!$A$3:$G$459,7,FALSE)=\"S\", \"\", VLOOKUP(A35,Calendar!$A$3:$G$459,7,FALSE)),IF(VLOOKUP(A35,Calendar!$A$3:$G$459,4,FALSE)=\"S\", \"\", VLOOKUP(A35,Calendar!$A$3:$G$459,4,FALSE))))","v":""},{"$f":"IF(Summary!$B$5=3,IF(C35=\"\",\"\",VLOOKUP(A35,Calendar!$A$3:$G$459,5,FALSE)),IF(C35=\"\",\"\",VLOOKUP(A35,Calendar!$A$3:$G$459,2,FALSE)))","v":""},null,null,null,null,0,null,null,""]
[1028,null,{"$f":"IF(ISNA(IF(Summary!$B$5=3,IF(VLOOKUP(A36,Calendar!$A$3:$G$459,7,FALSE)=\"S\", \"\", VLOOKUP(A36,Calendar!$A$3:$G$459,7,FALSE)),IF(VLOOKUP(A36,Calendar!$A$3:$G$459,4,FALSE)=\"S\", \"\", VLOOKUP(A36,Calendar!$A$3:$G$459,4,FALSE)))),\"\",IF(Summary!$B$5=3,IF(VLOOKUP(A36,Calendar!$A$3:$G$459,7,FALSE)=\"S\", \"\", VLOOKUP(A36,Calendar!$A$3:$G$459,7,FALSE)),IF(VLOOKUP(A36,Calendar!$A$3:$G$459,4,FALSE)=\"S\", \"\", VLOOKUP(A36,Calendar!$A$3:$G$459,4,FALSE))))","v":"M"},{"$f":"IF(Summary!$B$5=3,IF(C36=\"\",\"\",VLOOKUP(A36,Calendar!$A$3:$G$459,5,FALSE)),IF(C36=\"\",\"\",VLOOKUP(A36,Calendar!$A$3:$G$459,2,FALSE)))","v":"2019-10-28"},null,null,null,null,0,null,null,""]
[1029,null,{"$f":"IF(ISNA(IF(Summary!$B$5=3,IF(VLOOKUP(A37,Calendar!$A$3:$G$459,7,FALSE)=\"S\", \"\", VLOOKUP(A37,Calendar!$A$3:$G$459,7,FALSE)),IF(VLOOKUP(A37,Calendar!$A$3:$G$459,4,FALSE)=\"S\", \"\", VLOOKUP(A37,Calendar!$A$3:$G$459,4,FALSE)))),\"\",IF(Summary!$B$5=3,IF(VLOOKUP(A37,Calendar!$A$3:$G$459,7,FALSE)=\"S\", \"\", VLOOKUP(A37,Calendar!$A$3:$G$459,7,FALSE)),IF(VLOOKUP(A37,Calendar!$A$3:$G$459,4,FALSE)=\"S\", \"\", VLOOKUP(A37,Calendar!$A$3:$G$459,4,FALSE))))","v":"T"},{"$f":"IF(Summary!$B$5=3,IF(C37=\"\",\"\",VLOOKUP(A37,Calendar!$A$3:$G$459,5,FALSE)),IF(C37=\"\",\"\",VLOOKUP(A37,Calendar!$A$3:$G$459,2,FALSE)))","v":"2019-10-29"},null,null,null,null,0,null,null,""]
[1030,null,{"$f":"IF(ISNA(IF(Summary!$B$5=3,IF(VLOOKUP(A38,Calendar!$A$3:$G$459,7,FALSE)=\"S\", \"\", VLOOKUP(A38,Calendar!$A$3:$G$459,7,FALSE)),IF(VLOOKUP(A38,Calendar!$A$3:$G$459,4,FALSE)=\"S\", \"\", VLOOKUP(A38,Calendar!$A$3:$G$459,4,FALSE)))),\"\",IF(Summary!$B$5=3,IF(VLOOKUP(A38,Calendar!$A$3:$G$459,7,FALSE)=\"S\", \"\", VLOOKUP(A38,Calendar!$A$3:$G$459,7,FALSE)),IF(VLOOKUP(A38,Calendar!$A$3:$G$459,4,FALSE)=\"S\", \"\", VLOOKUP(A38,Calendar!$A$3:$G$459,4,FALSE))))","v":"W"},{"$f":"IF(Summary!$B$5=3,IF(C38=\"\",\"\",VLOOKUP(A38,Calendar!$A$3:$G$459,5,FALSE)),IF(C38=\"\",\"\",VLOOKUP(A38,Calendar!$A$3:$G$459,2,FALSE)))","v":"2019-10-30"},null,null,null,null,0,null,null,""]
[1031,null,{"$f":"IF(ISNA(IF(Summary!$B$5=3,IF(VLOOKUP(A39,Calendar!$A$3:$G$459,7,FALSE)=\"S\", \"\", VLOOKUP(A39,Calendar!$A$3:$G$459,7,FALSE)),IF(VLOOKUP(A39,Calendar!$A$3:$G$459,4,FALSE)=\"S\", \"\", VLOOKUP(A39,Calendar!$A$3:$G$459,4,FALSE)))),\"\",IF(Summary!$B$5=3,IF(VLOOKUP(A39,Calendar!$A$3:$G$459,7,FALSE)=\"S\", \"\", VLOOKUP(A39,Calendar!$A$3:$G$459,7,FALSE)),IF(VLOOKUP(A39,Calendar!$A$3:$G$459,4,FALSE)=\"S\", \"\", VLOOKUP(A39,Calendar!$A$3:$G$459,4,FALSE))))","v":"R"},{"$f":"IF(Summary!$B$5=3,IF(C39=\"\",\"\",VLOOKUP(A39,Calendar!$A$3:$G$459,5,FALSE)),IF(C39=\"\",\"\",VLOOKUP(A39,Calendar!$A$3:$G$459,2,FALSE)))","v":"2019-10-31"},null,null,null,null,0,null,null,""]
[null,null,null,"Total Minutes",{"$f":"SUM(E9:E39)","v":0},{"$f":"SUM(F9:F39)","v":0},0,0,0,null,null,{"$f":"IF(SUM(E40:H40)>COUNTA(E9:E39)*390,\"The sum total for all cost objectives exceeds the maximum anticipated value based upon the number of days worked. Confirm minutes claimed for each day.\",\"\")","v":""}]
[null,null,null,"Total Hours",{"$f":"E40/60","v":0},{"$f":"F40/60","v":0},0,0,0]
[]
[]
[null,null,"Notes"]
[]
[]
[]
[]
[]
[]
[]
[]
[]
[]
[null,null,null,null,"Kansas State Department of Education",null,null,null,"Personnel Activity Report"]
[null,null,null,null,"Fiscal Auditing",null,null,null,"Updated 9/20/18"]
[null,null,null,null,"785-296-4976"]
[null,null,null,null,"https://www.ksde.org/Agency/Fiscal-and-Administrative-Services/Fiscal-Auditing"]
[]
[]
[null,null,"The Kansas State Department of Education does not discriminate on the basis of race, color, national origin, sex, disability, or age in its programs and activities and provides equal access to the Boy Scouts and other designated youth groups. The following person has been designated to handle inquiries regarding the nondiscrimination policies: KSDE General Counsel, Office of General Counsel, KSDE, Landon State Office Building, 900 S.W. Jackson, Suite 102, Topeka, KS 66612, (785) 296-3204."]

{"sheet":"November","index":6,"n_rows":61,"n_cols":12,"rows_kept":61,"cut":false,"hidden":false,"merged":[[1,2,1,8],[3,2,3,8],[4,2,4,8],[49,2,49,8],[44,2,44,8],[45,2,45,8],[46,2,46,8],[47,2,47,8],[48,2,48,8],[60,2,61,8],[5,2,5,8],[6,2,6,8],[2,2,2,8],[43,3,43,8]]}
[]
[]
[null,null,"Personnel Activity Report"]
[null,null,"Regular School Year"]
[null,null,"November"]
[null,null,{"$f":"IF(Summary!$E$8<>\"\",Summary!$E$8,\" \")","v":" "}]
[null,null,{"$f":"IF(Summary!$E$9<>\"\",Summary!$E$9,\" \")","v":" "}]
[null,null,"Day","Date","Special Ed","General Ed","Other","Other","Totals",null,null,{"$f":"IF(OR(AND(F8=\"\",COUNTA(F9:F39)>0),AND(G8=\"\",COUNTA(G9:G39)>0),AND(H8=\"\",COUNTA(H9:H39)>0)),\"<<< You must identify the cost objective in the column heading.\",\"\")","v":""}]
[1101,null,{"$f":"IF(ISNA(IF(Summary!$B$5=3,IF(VLOOKUP(A9,Calendar!$A$3:$G$459,7,FALSE)=\"S\", \"\", VLOOKUP(A9,Calendar!$A$3:$G$459,7,FALSE)),IF(VLOOKUP(A9,Calendar!$A$3:$G$459,4,FALSE)=\"S\", \"\", VLOOKUP(A9,Calendar!$A$3:$G$459,4,FALSE)))),\"\",IF(Summary!$B$5=3,IF(VLOOKUP(A9,Calendar!$A$3:$G$459,7,FALSE)=\"S\", \"\", VLOOKUP(A9,Calendar!$A$3:$G$459,7,FALSE)),IF(VLOOKUP(A9,Calendar!$A$3:$G$459,4,FALSE)=\"S\", \"\", VLOOKUP(A9,Calendar!$A$3:$G$459,4,FALSE))))","v":"F"},{"$f":"IF(Summary!$B$5=3,IF(C9=\"\",\"\",VLOOKUP(A9,Calendar!$A$3:$G$459,5,FALSE)),IF(C9=\"\",\"\",VLOOKUP(A9,Calendar!$A$3:$G$459,2,FALSE)))","v":"2019-11-01"},null,null,null,null,{"$f":"MIN(1440,SUM(E9:H9))","v":0},null,null,{"$f":"IF(I9>390, \"<<< Day exceeds 390 minutes. Confirm reported time.\",\"\")","v":""}]
[1102,null,{"$f":"IF(ISNA(IF(Summary!$B$5=3,IF(VLOOKUP(A10,Calendar!$A$3:$G$459,7,FALSE)=\"S\", \"\", VLOOKUP(A10,Calendar!$A$3:$G$459,7,FALSE)),IF(VLOOKUP(A10,Calendar!$A$3:$G$459,4,FALSE)=\"S\", \"\", VLOOKUP(A10,Calendar!$A$3:$G$459,4,FALSE)))),\"\",IF(Summary!$B$5=3,IF(VLOOKUP(A10,Calendar!$A$3:$G$459,7,FALSE)=\"S\", \"\", VLOOKUP(A10,Calendar!$A$3:$G$459,7,FALSE)),IF(VLOOKUP(A10,Calendar!$A$3:$G$459,4,FALSE)=\"S\", \"\", VLOOKUP(A10,Calendar!$A$3:$G$459,4,FALSE))))","v":""},{"$f":"IF(Summary!$B$5=3,IF(C10=\"\",\"\",VLOOKUP(A10,Calendar!$A$3:$G$459,5,FALSE)),IF(C10=\"\",\"\",VLOOKUP(A10,Calendar!$A$3:$G$459,2,FALSE)))","v":""},null,null,null,null,{"$f":"MIN(1440,SUM(E10:H10))","v":0},null,null,{"$f":"IF(I10>390, \"<<< Day exceeds 390 minutes. Confirm reported time.\",\"\")","v":""}]
[1103,null,{"$f":"IF(ISNA(IF(Summary!$B$5=3,IF(VLOOKUP(A11,Calendar!$A$3:$G$459,7,FALSE)=\"S\", \"\", VLOOKUP(A11,Calendar!$A$3:$G$459,7,FALSE)),IF(VLOOKUP(A11,Calendar!$A$3:$G$459,4,FALSE)=\"S\", \"\", VLOOKUP(A11,Calendar!$A$3:$G$459,4,FALSE)))),\"\",IF(Summary!$B$5=3,IF(VLOOKUP(A11,Calendar!$A$3:$G$459,7,FALSE)=\"S\", \"\", VLOOKUP(A11,Calendar!$A$3:$G$459,7,FALSE)),IF(VLOOKUP(A11,Calendar!$A$3:$G$459,4,FALSE)=\"S\", \"\", VLOOKUP(A11,Calendar!$A$3:$G$459,4,FALSE))))","v":""},{"$f":"IF(Summary!$B$5=3,IF(C11=\"\",\"\",VLOOKUP(A11,Calendar!$A$3:$G$459,5,FALSE)),IF(C11=\"\",\"\",VLOOKUP(A11,Calendar!$A$3:$G$459,2,FALSE)))","v":""},null,null,null,null,0,null,null,""]
[1104,null,{"$f":"IF(ISNA(IF(Summary!$B$5=3,IF(VLOOKUP(A12,Calendar!$A$3:$G$459,7,FALSE)=\"S\", \"\", VLOOKUP(A12,Calendar!$A$3:$G$459,7,FALSE)),IF(VLOOKUP(A12,Calendar!$A$3:$G$459,4,FALSE)=\"S\", \"\", VLOOKUP(A12,Calendar!$A$3:$G$459,4,FALSE)))),\"\",IF(Summary!$B$5=3,IF(VLOOKUP(A12,Calendar!$A$3:$G$459,7,FALSE)=\"S\", \"\", VLOOKUP(A12,Calendar!$A$3:$G$459,7,FALSE)),IF(VLOOKUP(A12,Calendar!$A$3:$G$459,4,FALSE)=\"S\", \"\", VLOOKUP(A12,Calendar!$A$3:$G$459,4,FALSE))))","v":"M"},{"$f":"IF(Summary!$B$5=3,IF(C12=\"\",\"\",VLOOKUP(A12,Calendar!$A$3:$G$459,5,FALSE)),IF(C12=\"\",\"\",VLOOKUP(A12,Calendar!$A$3:$G$459,2,FALSE)))","v":"2019-11-04"},null,null,null,null,0,null,null,""]
[1105,null,{"$f":"IF(ISNA(IF(Summary!$B$5=3,IF(VLOOKUP(A13,Calendar!$A$3:$G$459,7,FALSE)=\"S\", \"\", VLOOKUP(A13,Calendar!$A$3:$G$459,7,FALSE)),IF(VLOOKUP(A13,Calendar!$A$3:$G$459,4,FALSE)=\"S\", \"\", VLOOKUP(A13,Calendar!$A$3:$G$459,4,FALSE)))),\"\",IF(Summary!$B$5=3,IF(VLOOKUP(A13,Calendar!$A$3:$G$459,7,FALSE)=\"S\", \"\", VLOOKUP(A13,Calendar!$A$3:$G$459,7,FALSE)),IF(VLOOKUP(A13,Calendar!$A$3:$G$459,4,FALSE)=\"S\", \"\", VLOOKUP(A13,Calendar!$A$3:$G$459,4,FALSE))))","v":"T"},{"$f":"IF(Summary!$B$5=3,IF(C13=\"\",\"\",VLOOKUP(A13,Calendar!$A$3:$G$459,5,FALSE)),IF(C13=\"\",\"\",VLOOKUP(A13,Calendar!$A$3:$G$459,2,FALSE)))","v":"2019-11-05"},null,null,null,null,0,null,null,""]
[1106,null,{"$f":"IF(ISNA(IF(Summary!$B$5=3,IF(VLOOKUP(A14,Calendar!$A$3:$G$459,7,FALSE)=\"S\", \"\", VLOOKUP(A14,Calendar!$A$3:$G$459,7,FALSE)),IF(VLOOKUP(A14,Calendar!$A$3:$G$459,4,FALSE)=\"S\", \"\", VLOOKUP(A14,Calendar!$A$3:$G$459,4,FALSE)))),\"\",IF(Summary!$B$5=3,IF(VLOOKUP(A14,Calendar!$A$3:$G$459,7,FALSE)=\"S\", \"\", VLOOKUP(A14,Calendar!$A$3:$G$459,7,FALSE)),IF(VLOOKUP(A14,Calendar!$A$3:$G$459,4,FALSE)=\"S\", \"\", VLOOKUP(A14,Calendar!$A$3:$G$459,4,FALSE))))","v":"W"},{"$f":"IF(Summary!$B$5=3,IF(C14=\"\",\"\",VLOOKUP(A14,Calendar!$A$3:$G$459,5,FALSE)),IF(C14=\"\",\"\",VLOOKUP(A14,Calendar!$A$3:$G$459,2,FALSE)))","v":"2019-11-06"},null,null,null,null,0,null,null,""]
[1107,null,{"$f":"IF(ISNA(IF(Summary!$B$5=3,IF(VLOOKUP(A15,Calendar!$A$3:$G$459,7,FALSE)=\"S\", \"\", VLOOKUP(A15,Calendar!$A$3:$G$459,7,FALSE)),IF(VLOOKUP(A15,Calendar!$A$3:$G$459,4,FALSE)=\"S\", \"\", VLOOKUP(A15,Calendar!$A$3:$G$459,4,FALSE)))),\"\",IF(Summary!$B$5=3,IF(VLOOKUP(A15,Calendar!$A$3:$G$459,7,FALSE)=\"S\", \"\", VLOOKUP(A15,Calendar!$A$3:$G$459,7,FALSE)),IF(VLOOKUP(A15,Calendar!$A$3:$G$459,4,FALSE)=\"S\", \"\", VLOOKUP(A15,Calendar!$A$3:$G$459,4,FALSE))))","v":"R"},{"$f":"IF(Summary!$B$5=3,IF(C15=\"\",\"\",VLOOKUP(A15,Calendar!$A$3:$G$459,5,FALSE)),IF(C15=\"\",\"\",VLOOKUP(A15,Calendar!$A$3:$G$459,2,FALSE)))","v":"2019-11-07"},null,null,null,null,0,null,null,""]
[1108,null,{"$f":"IF(ISNA(IF(Summary!$B$5=3,IF(VLOOKUP(A16,Calendar!$A$3:$G$459,7,FALSE)=\"S\", \"\", VLOOKUP(A16,Calendar!$A$3:$G$459,7,FALSE)),IF(VLOOKUP(A16,Calendar!$A$3:$G$459,4,FALSE)=\"S\", \"\", VLOOKUP(A16,Calendar!$A$3:$G$459,4,FALSE)))),\"\",IF(Summary!$B$5=3,IF(VLOOKUP(A16,Calendar!$A$3:$G$459,7,FALSE)=\"S\", \"\", VLOOKUP(A16,Calendar!$A$3:$G$459,7,FALSE)),IF(VLOOKUP(A16,Calendar!$A$3:$G$459,4,FALSE)=\"S\", \"\", VLOOKUP(A16,Calendar!$A$3:$G$459,4,FALSE))))","v":"F"},{"$f":"IF(Summary!$B$5=3,IF(C16=\"\",\"\",VLOOKUP(A16,Calendar!$A$3:$G$459,5,FALSE)),IF(C16=\"\",\"\",VLOOKUP(A16,Calendar!$A$3:$G$459,2,FALSE)))","v":"2019-11-08"},null,null,null,null,0,null,null,""]
[1109,null,{"$f":"IF(ISNA(IF(Summary!$B$5=3,IF(VLOOKUP(A17,Calendar!$A$3:$G$459,7,FALSE)=\"S\", \"\", VLOOKUP(A17,Calendar!$A$3:$G$459,7,FALSE)),IF(VLOOKUP(A17,Calendar!$A$3:$G$459,4,FALSE)=\"S\", \"\", VLOOKUP(A17,Calendar!$A$3:$G$459,4,FALSE)))),\"\",IF(Summary!$B$5=3,IF(VLOOKUP(A17,Calendar!$A$3:$G$459,7,FALSE)=\"S\", \"\", VLOOKUP(A17,Calendar!$A$3:$G$459,7,FALSE)),IF(VLOOKUP(A17,Calendar!$A$3:$G$459,4,FALSE)=\"S\", \"\", VLOOKUP(A17,Calendar!$A$3:$G$459,4,FALSE))))","v":""},{"$f":"IF(Summary!$B$5=3,IF(C17=\"\",\"\",VLOOKUP(A17,Calendar!$A$3:$G$459,5,FALSE)),IF(C17=\"\",\"\",VLOOKUP(A17,Calendar!$A$3:$G$459,2,FALSE)))","v":""},null,null,null,null,0,null,null,""]
[1110,null,{"$f":"IF(ISNA(IF(Summary!$B$5=3,IF(VLOOKUP(A18,Calendar!$A$3:$G$459,7,FALSE)=\"S\", \"\", VLOOKUP(A18,Calendar!$A$3:$G$459,7,FALSE)),IF(VLOOKUP(A18,Calendar!$A$3:$G$459,4,FALSE)=\"S\", \"\", VLOOKUP(A18,Calendar!$A$3:$G$459,4,FALSE)))),\"\",IF(Summary!$B$5=3,IF(VLOOKUP(A18,Calendar!$A$3:$G$459,7,FALSE)=\"S\", \"\", VLOOKUP(A18,Calendar!$A$3:$G$459,7,FALSE)),IF(VLOOKUP(A18,Calendar!$A$3:$G$459,4,FALSE)=\"S\", \"\", VLOOKUP(A18,Calendar!$A$3:$G$459,4,FALSE))))","v":""},{"$f":"IF(Summary!$B$5=3,IF(C18=\"\",\"\",VLOOKUP(A18,Calendar!$A$3:$G$459,5,FALSE)),IF(C18=\"\",\"\",VLOOKUP(A18,Calendar!$A$3:$G$459,2,FALSE)))","v":""},null,null,null,null,0,null,null,""]
[1111,null,{"$f":"IF(ISNA(IF(Summary!$B$5=3,IF(VLOOKUP(A19,Calendar!$A$3:$G$459,7,FALSE)=\"S\", \"\", VLOOKUP(A19,Calendar!$A$3:$G$459,7,FALSE)),IF(VLOOKUP(A19,Calendar!$A$3:$G$459,4,FALSE)=\"S\", \"\", VLOOKUP(A19,Calendar!$A$3:$G$459,4,FALSE)))),\"\",IF(Summary!$B$5=3,IF(VLOOKUP(A19,Calendar!$A$3:$G$459,7,FALSE)=\"S\", \"\", VLOOKUP(A19,Calendar!$A$3:$G$459,7,FALSE)),IF(VLOOKUP(A19,Calendar!$A$3:$G$459,4,FALSE)=\"S\", \"\", VLOOKUP(A19,Calendar!$A$3:$G$459,4,FALSE))))","v":"M"},{"$f":"IF(Summary!$B$5=3,IF(C19=\"\",\"\",VLOOKUP(A19,Calendar!$A$3:$G$459,5,FALSE)),IF(C19=\"\",\"\",VLOOKUP(A19,Calendar!$A$3:$G$459,2,FALSE)))","v":"2019-11-11"},null,null,null,null,0,null,null,""]
[1112,null,{"$f":"IF(ISNA(IF(Summary!$B$5=3,IF(VLOOKUP(A20,Calendar!$A$3:$G$459,7,FALSE)=\"S\", \"\", VLOOKUP(A20,Calendar!$A$3:$G$459,7,FALSE)),IF(VLOOKUP(A20,Calendar!$A$3:$G$459,4,FALSE)=\"S\", \"\", VLOOKUP(A20,Calendar!$A$3:$G$459,4,FALSE)))),\"\",IF(Summary!$B$5=3,IF(VLOOKUP(A20,Calendar!$A$3:$G$459,7,FALSE)=\"S\", \"\", VLOOKUP(A20,Calendar!$A$3:$G$459,7,FALSE)),IF(VLOOKUP(A20,Calendar!$A$3:$G$459,4,FALSE)=\"S\", \"\", VLOOKUP(A20,Calendar!$A$3:$G$459,4,FALSE))))","v":"T"},{"$f":"IF(Summary!$B$5=3,IF(C20=\"\",\"\",VLOOKUP(A20,Calendar!$A$3:$G$459,5,FALSE)),IF(C20=\"\",\"\",VLOOKUP(A20,Calendar!$A$3:$G$459,2,FALSE)))","v":"2019-11-12"},null,null,null,null,0,null,null,""]
[1113,null,{"$f":"IF(ISNA(IF(Summary!$B$5=3,IF(VLOOKUP(A21,Calendar!$A$3:$G$459,7,FALSE)=\"S\", \"\", VLOOKUP(A21,Calendar!$A$3:$G$459,7,FALSE)),IF(VLOOKUP(A21,Calendar!$A$3:$G$459,4,FALSE)=\"S\", \"\", VLOOKUP(A21,Calendar!$A$3:$G$459,4,FALSE)))),\"\",IF(Summary!$B$5=3,IF(VLOOKUP(A21,Calendar!$A$3:$G$459,7,FALSE)=\"S\", \"\", VLOOKUP(A21,Calendar!$A$3:$G$459,7,FALSE)),IF(VLOOKUP(A21,Calendar!$A$3:$G$459,4,FALSE)=\"S\", \"\", VLOOKUP(A21,Calendar!$A$3:$G$459,4,FALSE))))","v":"W"},{"$f":"IF(Summary!$B$5=3,IF(C21=\"\",\"\",VLOOKUP(A21,Calendar!$A$3:$G$459,5,FALSE)),IF(C21=\"\",\"\",VLOOKUP(A21,Calendar!$A$3:$G$459,2,FALSE)))","v":"2019-11-13"},null,null,null,null,0,null,null,""]
[1114,null,{"$f":"IF(ISNA(IF(Summary!$B$5=3,IF(VLOOKUP(A22,Calendar!$A$3:$G$459,7,FALSE)=\"S\", \"\", VLOOKUP(A22,Calendar!$A$3:$G$459,7,FALSE)),IF(VLOOKUP(A22,Calendar!$A$3:$G$459,4,FALSE)=\"S\", \"\", VLOOKUP(A22,Calendar!$A$3:$G$459,4,FALSE)))),\"\",IF(Summary!$B$5=3,IF(VLOOKUP(A22,Calendar!$A$3:$G$459,7,FALSE)=\"S\", \"\", VLOOKUP(A22,Calendar!$A$3:$G$459,7,FALSE)),IF(VLOOKUP(A22,Calendar!$A$3:$G$459,4,FALSE)=\"S\", \"\", VLOOKUP(A22,Calendar!$A$3:$G$459,4,FALSE))))","v":"R"},{"$f":"IF(Summary!$B$5=3,IF(C22=\"\",\"\",VLOOKUP(A22,Calendar!$A$3:$G$459,5,FALSE)),IF(C22=\"\",\"\",VLOOKUP(A22,Calendar!$A$3:$G$459,2,FALSE)))","v":"2019-11-14"},null,null,null,null,0,null,null,""]
[1115,null,{"$f":"IF(ISNA(IF(Summary!$B$5=3,IF(VLOOKUP(A23,Calendar!$A$3:$G$459,7,FALSE)=\"S\", \"\", VLOOKUP(A23,Calendar!$A$3:$G$459,7,FALSE)),IF(VLOOKUP(A23,Calendar!$A$3:$G$459,4,FALSE)=\"S\", \"\", VLOOKUP(A23,Calendar!$A$3:$G$459,4,FALSE)))),\"\",IF(Summary!$B$5=3,IF(VLOOKUP(A23,Calendar!$A$3:$G$459,7,FALSE)=\"S\", \"\", VLOOKUP(A23,Calendar!$A$3:$G$459,7,FALSE)),IF(VLOOKUP(A23,Calendar!$A$3:$G$459,4,FALSE)=\"S\", \"\", VLOOKUP(A23,Calendar!$A$3:$G$459,4,FALSE))))","v":"F"},{"$f":"IF(Summary!$B$5=3,IF(C23=\"\",\"\",VLOOKUP(A23,Calendar!$A$3:$G$459,5,FALSE)),IF(C23=\"\",\"\",VLOOKUP(A23,Calendar!$A$3:$G$459,2,FALSE)))","v":"2019-11-15"},null,null,null,null,0,null,null,""]
[1116,null,{"$f":"IF(ISNA(IF(Summary!$B$5=3,IF(VLOOKUP(A24,Calendar!$A$3:$G$459,7,FALSE)=\"S\", \"\", VLOOKUP(A24,Calendar!$A$3:$G$459,7,FALSE)),IF(VLOOKUP(A24,Calendar!$A$3:$G$459,4,FALSE)=\"S\", \"\", VLOOKUP(A24,Calendar!$A$3:$G$459,4,FALSE)))),\"\",IF(Summary!$B$5=3,IF(VLOOKUP(A24,Calendar!$A$3:$G$459,7,FALSE)=\"S\", \"\", VLOOKUP(A24,Calendar!$A$3:$G$459,7,FALSE)),IF(VLOOKUP(A24,Calendar!$A$3:$G$459,4,FALSE)=\"S\", \"\", VLOOKUP(A24,Calendar!$A$3:$G$459,4,FALSE))))","v":""},{"$f":"IF(Summary!$B$5=3,IF(C24=\"\",\"\",VLOOKUP(A24,Calendar!$A$3:$G$459,5,FALSE)),IF(C24=\"\",\"\",VLOOKUP(A24,Calendar!$A$3:$G$459,2,FALSE)))","v":""},null,null,null,null,0,null,null,""]
[1117,null,{"$f":"IF(ISNA(IF(Summary!$B$5=3,IF(VLOOKUP(A25,Calendar!$A$3:$G$459,7,FALSE)=\"S\", \"\", VLOOKUP(A25,Calendar!$A$3:$G$459,7,FALSE)),IF(VLOOKUP(A25,Calendar!$A$3:$G$459,4,FALSE)=\"S\", \"\", VLOOKUP(A25,Calendar!$A$3:$G$459,4,FALSE)))),\"\",IF(Summary!$B$5=3,IF(VLOOKUP(A25,Calendar!$A$3:$G$459,7,FALSE)=\"S\", \"\", VLOOKUP(A25,Calendar!$A$3:$G$459,7,FALSE)),IF(VLOOKUP(A25,Calendar!$A$3:$G$459,4,FALSE)=\"S\", \"\", VLOOKUP(A25,Calendar!$A$3:$G$459,4,FALSE))))","v":""},{"$f":"IF(Summary!$B$5=3,IF(C25=\"\",\"\",VLOOKUP(A25,Calendar!$A$3:$G$459,5,FALSE)),IF(C25=\"\",\"\",VLOOKUP(A25,Calendar!$A$3:$G$459,2,FALSE)))","v":""},null,null,null,null,0,null,null,""]
[1118,null,{"$f":"IF(ISNA(IF(Summary!$B$5=3,IF(VLOOKUP(A26,Calendar!$A$3:$G$459,7,FALSE)=\"S\", \"\", VLOOKUP(A26,Calendar!$A$3:$G$459,7,FALSE)),IF(VLOOKUP(A26,Calendar!$A$3:$G$459,4,FALSE)=\"S\", \"\", VLOOKUP(A26,Calendar!$A$3:$G$459,4,FALSE)))),\"\",IF(Summary!$B$5=3,IF(VLOOKUP(A26,Calendar!$A$3:$G$459,7,FALSE)=\"S\", \"\", VLOOKUP(A26,Calendar!$A$3:$G$459,7,FALSE)),IF(VLOOKUP(A26,Calendar!$A$3:$G$459,4,FALSE)=\"S\", \"\", VLOOKUP(A26,Calendar!$A$3:$G$459,4,FALSE))))","v":"M"},{"$f":"IF(Summary!$B$5=3,IF(C26=\"\",\"\",VLOOKUP(A26,Calendar!$A$3:$G$459,5,FALSE)),IF(C26=\"\",\"\",VLOOKUP(A26,Calendar!$A$3:$G$459,2,FALSE)))","v":"2019-11-18"},null,null,null,null,0,null,null,""]
[1119,null,{"$f":"IF(ISNA(IF(Summary!$B$5=3,IF(VLOOKUP(A27,Calendar!$A$3:$G$459,7,FALSE)=\"S\", \"\", VLOOKUP(A27,Calendar!$A$3:$G$459,7,FALSE)),IF(VLOOKUP(A27,Calendar!$A$3:$G$459,4,FALSE)=\"S\", \"\", VLOOKUP(A27,Calendar!$A$3:$G$459,4,FALSE)))),\"\",IF(Summary!$B$5=3,IF(VLOOKUP(A27,Calendar!$A$3:$G$459,7,FALSE)=\"S\", \"\", VLOOKUP(A27,Calendar!$A$3:$G$459,7,FALSE)),IF(VLOOKUP(A27,Calendar!$A$3:$G$459,4,FALSE)=\"S\", \"\", VLOOKUP(A27,Calendar!$A$3:$G$459,4,FALSE))))","v":"T"},{"$f":"IF(Summary!$B$5=3,IF(C27=\"\",\"\",VLOOKUP(A27,Calendar!$A$3:$G$459,5,FALSE)),IF(C27=\"\",\"\",VLOOKUP(A27,Calendar!$A$3:$G$459,2,FALSE)))","v":"2019-11-19"},null,null,null,null,0,null,null,""]
[1120,null,{"$f":"IF(ISNA(IF(Summary!$B$5=3,IF(VLOOKUP(A28,Calendar!$A$3:$G$459,7,FALSE)=\"S\", \"\", VLOOKUP(A28,Calendar!$A$3:$G$459,7,FALSE)),IF(VLOOKUP(A28,Calendar!$A$3:$G$459,4,FALSE)=\"S\", \"\", VLOOKUP(A28,Calendar!$A$3:$G$459,4,FALSE)))),\"\",IF(Summary!$B$5=3,IF(VLOOKUP(A28,Calendar!$A$3:$G$459,7,FALSE)=\"S\", \"\", VLOOKUP(A28,Calendar!$A$3:$G$459,7,FALSE)),IF(VLOOKUP(A28,Calendar!$A$3:$G$459,4,FALSE)=\"S\", \"\", VLOOKUP(A28,Calendar!$A$3:$G$459,4,FALSE))))","v":"W"},{"$f":"IF(Summary!$B$5=3,IF(C28=\"\",\"\",VLOOKUP(A28,Calendar!$A$3:$G$459,5,FALSE)),IF(C28=\"\",\"\",VLOOKUP(A28,Calendar!$A$3:$G$459,2,FALSE)))","v":"2019-11-20"},null,null,null,null,0,null,null,""]
[1121,null,{"$f":"IF(ISNA(IF(Summary!$B$5=3,IF(VLOOKUP(A29,Calendar!$A$3:$G$459,7,FALSE)=\"S\", \"\", VLOOKUP(A29,Calendar!$A$3:$G$459,7,FALSE)),IF(VLOOKUP(A29,Calendar!$A$3:$G$459,4,FALSE)=\"S\", \"\", VLOOKUP(A29,Calendar!$A$3:$G$459,4,FALSE)))),\"\",IF(Summary!$B$5=3,IF(VLOOKUP(A29,Calendar!$A$3:$G$459,7,FALSE)=\"S\", \"\", VLOOKUP(A29,Calendar!$A$3:$G$459,7,FALSE)),IF(VLOOKUP(A29,Calendar!$A$3:$G$459,4,FALSE)=\"S\", \"\", VLOOKUP(A29,Calendar!$A$3:$G$459,4,FALSE))))","v":"R"},{"$f":"IF(Summary!$B$5=3,IF(C29=\"\",\"\",VLOOKUP(A29,Calendar!$A$3:$G$459,5,FALSE)),IF(C29=\"\",\"\",VLOOKUP(A29,Calendar!$A$3:$G$459,2,FALSE)))","v":"2019-11-21"},null,null,null,null,0,null,null,""]
[1122,null,{"$f":"IF(ISNA(IF(Summary!$B$5=3,IF(VLOOKUP(A30,Calendar!$A$3:$G$459,7,FALSE)=\"S\", \"\", VLOOKUP(A30,Calendar!$A$3:$G$459,7,FALSE)),IF(VLOOKUP(A30,Calendar!$A$3:$G$459,4,FALSE)=\"S\", \"\", VLOOKUP(A30,Calendar!$A$3:$G$459,4,FALSE)))),\"\",IF(Summary!$B$5=3,IF(VLOOKUP(A30,Calendar!$A$3:$G$459,7,FALSE)=\"S\", \"\", VLOOKUP(A30,Calendar!$A$3:$G$459,7,FALSE)),IF(VLOOKUP(A30,Calendar!$A$3:$G$459,4,FALSE)=\"S\", \"\", VLOOKUP(A30,Calendar!$A$3:$G$459,4,FALSE))))","v":"F"},{"$f":"IF(Summary!$B$5=3,IF(C30=\"\",\"\",VLOOKUP(A30,Calendar!$A$3:$G$459,5,FALSE)),IF(C30=\"\",\"\",VLOOKUP(A30,Calendar!$A$3:$G$459,2,FALSE)))","v":"2019-11-22"},null,null,null,null,0,null,null,""]
[1123,null,{"$f":"IF(ISNA(IF(Summary!$B$5=3,IF(VLOOKUP(A31,Calendar!$A$3:$G$459,7,FALSE)=\"S\", \"\", VLOOKUP(A31,Calendar!$A$3:$G$459,7,FALSE)),IF(VLOOKUP(A31,Calendar!$A$3:$G$459,4,FALSE)=\"S\", \"\", VLOOKUP(A31,Calendar!$A$3:$G$459,4,FALSE)))),\"\",IF(Summary!$B$5=3,IF(VLOOKUP(A31,Calendar!$A$3:$G$459,7,FALSE)=\"S\", \"\", VLOOKUP(A31,Calendar!$A$3:$G$459,7,FALSE)),IF(VLOOKUP(A31,Calendar!$A$3:$G$459,4,FALSE)=\"S\", \"\", VLOOKUP(A31,Calendar!$A$3:$G$459,4,FALSE))))","v":""},{"$f":"IF(Summary!$B$5=3,IF(C31=\"\",\"\",VLOOKUP(A31,Calendar!$A$3:$G$459,5,FALSE)),IF(C31=\"\",\"\",VLOOKUP(A31,Calendar!$A$3:$G$459,2,FALSE)))","v":""},null,null,null,null,0,null,null,""]
[1124,null,{"$f":"IF(ISNA(IF(Summary!$B$5=3,IF(VLOOKUP(A32,Calendar!$A$3:$G$459,7,FALSE)=\"S\", \"\", VLOOKUP(A32,Calendar!$A$3:$G$459,7,FALSE)),IF(VLOOKUP(A32,Calendar!$A$3:$G$459,4,FALSE)=\"S\", \"\", VLOOKUP(A32,Calendar!$A$3:$G$459,4,FALSE)))),\"\",IF(Summary!$B$5=3,IF(VLOOKUP(A32,Calendar!$A$3:$G$459,7,FALSE)=\"S\", \"\", VLOOKUP(A32,Calendar!$A$3:$G$459,7,FALSE)),IF(VLOOKUP(A32,Calendar!$A$3:$G$459,4,FALSE)=\"S\", \"\", VLOOKUP(A32,Calendar!$A$3:$G$459,4,FALSE))))","v":""},{"$f":"IF(Summary!$B$5=3,IF(C32=\"\",\"\",VLOOKUP(A32,Calendar!$A$3:$G$459,5,FALSE)),IF(C32=\"\",\"\",VLOOKUP(A32,Calendar!$A$3:$G$459,2,FALSE)))","v":""},null,null,null,null,0,null,null,""]
[1125,null,{"$f":"IF(ISNA(IF(Summary!$B$5=3,IF(VLOOKUP(A33,Calendar!$A$3:$G$459,7,FALSE)=\"S\", \"\", VLOOKUP(A33,Calendar!$A$3:$G$459,7,FALSE)),IF(VLOOKUP(A33,Calendar!$A$3:$G$459,4,FALSE)=\"S\", \"\", VLOOKUP(A33,Calendar!$A$3:$G$459,4,FALSE)))),\"\",IF(Summary!$B$5=3,IF(VLOOKUP(A33,Calendar!$A$3:$G$459,7,FALSE)=\"S\", \"\", VLOOKUP(A33,Calendar!$A$3:$G$459,7,FALSE)),IF(VLOOKUP(A33,Calendar!$A$3:$G$459,4,FALSE)=\"S\", \"\", VLOOKUP(A33,Calendar!$A$3:$G$459,4,FALSE))))","v":"M"},{"$f":"IF(Summary!$B$5=3,IF(C33=\"\",\"\",VLOOKUP(A33,Calendar!$A$3:$G$459,5,FALSE)),IF(C33=\"\",\"\",VLOOKUP(A33,Calendar!$A$3:$G$459,2,FALSE)))","v":"2019-11-25"},null,null,null,null,0,null,null,""]
[1126,null,{"$f":"IF(ISNA(IF(Summary!$B$5=3,IF(VLOOKUP(A34,Calendar!$A$3:$G$459,7,FALSE)=\"S\", \"\", VLOOKUP(A34,Calendar!$A$3:$G$459,7,FALSE)),IF(VLOOKUP(A34,Calendar!$A$3:$G$459,4,FALSE)=\"S\", \"\", VLOOKUP(A34,Calendar!$A$3:$G$459,4,FALSE)))),\"\",IF(Summary!$B$5=3,IF(VLOOKUP(A34,Calendar!$A$3:$G$459,7,FALSE)=\"S\", \"\", VLOOKUP(A34,Calendar!$A$3:$G$459,7,FALSE)),IF(VLOOKUP(A34,Calendar!$A$3:$G$459,4,FALSE)=\"S\", \"\", VLOOKUP(A34,Calendar!$A$3:$G$459,4,FALSE))))","v":"T"},{"$f":"IF(Summary!$B$5=3,IF(C34=\"\",\"\",VLOOKUP(A34,Calendar!$A$3:$G$459,5,FALSE)),IF(C34=\"\",\"\",VLOOKUP(A34,Calendar!$A$3:$G$459,2,FALSE)))","v":"2019-11-26"},null,null,null,null,0,null,null,""]
[1127,null,{"$f":"IF(ISNA(IF(Summary!$B$5=3,IF(VLOOKUP(A35,Calendar!$A$3:$G$459,7,FALSE)=\"S\", \"\", VLOOKUP(A35,Calendar!$A$3:$G$459,7,FALSE)),IF(VLOOKUP(A35,Calendar!$A$3:$G$459,4,FALSE)=\"S\", \"\", VLOOKUP(A35,Calendar!$A$3:$G$459,4,FALSE)))),\"\",IF(Summary!$B$5=3,IF(VLOOKUP(A35,Calendar!$A$3:$G$459,7,FALSE)=\"S\", \"\", VLOOKUP(A35,Calendar!$A$3:$G$459,7,FALSE)),IF(VLOOKUP(A35,Calendar!$A$3:$G$459,4,FALSE)=\"S\", \"\", VLOOKUP(A35,Calendar!$A$3:$G$459,4,FALSE))))","v":"W"},{"$f":"IF(Summary!$B$5=3,IF(C35=\"\",\"\",VLOOKUP(A35,Calendar!$A$3:$G$459,5,FALSE)),IF(C35=\"\",\"\",VLOOKUP(A35,Calendar!$A$3:$G$459,2,FALSE)))","v":"2019-11-27"},null,null,null,null,0,null,null,""]
[1128,null,{"$f":"IF(ISNA(IF(Summary!$B$5=3,IF(VLOOKUP(A36,Calendar!$A$3:$G$459,7,FALSE)=\"S\", \"\", VLOOKUP(A36,Calendar!$A$3:$G$459,7,FALSE)),IF(VLOOKUP(A36,Calendar!$A$3:$G$459,4,FALSE)=\"S\", \"\", VLOOKUP(A36,Calendar!$A$3:$G$459,4,FALSE)))),\"\",IF(Summary!$B$5=3,IF(VLOOKUP(A36,Calendar!$A$3:$G$459,7,FALSE)=\"S\", \"\", VLOOKUP(A36,Calendar!$A$3:$G$459,7,FALSE)),IF(VLOOKUP(A36,Calendar!$A$3:$G$459,4,FALSE)=\"S\", \"\", VLOOKUP(A36,Calendar!$A$3:$G$459,4,FALSE))))","v":"R"},{"$f":"IF(Summary!$B$5=3,IF(C36=\"\",\"\",VLOOKUP(A36,Calendar!$A$3:$G$459,5,FALSE)),IF(C36=\"\",\"\",VLOOKUP(A36,Calendar!$A$3:$G$459,2,FALSE)))","v":"2019-11-28"},null,null,null,null,0,null,null,""]
[1129,null,{"$f":"IF(ISNA(IF(Summary!$B$5=3,IF(VLOOKUP(A37,Calendar!$A$3:$G$459,7,FALSE)=\"S\", \"\", VLOOKUP(A37,Calendar!$A$3:$G$459,7,FALSE)),IF(VLOOKUP(A37,Calendar!$A$3:$G$459,4,FALSE)=\"S\", \"\", VLOOKUP(A37,Calendar!$A$3:$G$459,4,FALSE)))),\"\",IF(Summary!$B$5=3,IF(VLOOKUP(A37,Calendar!$A$3:$G$459,7,FALSE)=\"S\", \"\", VLOOKUP(A37,Calendar!$A$3:$G$459,7,FALSE)),IF(VLOOKUP(A37,Calendar!$A$3:$G$459,4,FALSE)=\"S\", \"\", VLOOKUP(A37,Calendar!$A$3:$G$459,4,FALSE))))","v":"F"},{"$f":"IF(Summary!$B$5=3,IF(C37=\"\",\"\",VLOOKUP(A37,Calendar!$A$3:$G$459,5,FALSE)),IF(C37=\"\",\"\",VLOOKUP(A37,Calendar!$A$3:$G$459,2,FALSE)))","v":"2019-11-29"},null,null,null,null,0,null,null,""]
[1130,null,{"$f":"IF(ISNA(IF(Summary!$B$5=3,IF(VLOOKUP(A38,Calendar!$A$3:$G$459,7,FALSE)=\"S\", \"\", VLOOKUP(A38,Calendar!$A$3:$G$459,7,FALSE)),IF(VLOOKUP(A38,Calendar!$A$3:$G$459,4,FALSE)=\"S\", \"\", VLOOKUP(A38,Calendar!$A$3:$G$459,4,FALSE)))),\"\",IF(Summary!$B$5=3,IF(VLOOKUP(A38,Calendar!$A$3:$G$459,7,FALSE)=\"S\", \"\", VLOOKUP(A38,Calendar!$A$3:$G$459,7,FALSE)),IF(VLOOKUP(A38,Calendar!$A$3:$G$459,4,FALSE)=\"S\", \"\", VLOOKUP(A38,Calendar!$A$3:$G$459,4,FALSE))))","v":""},{"$f":"IF(Summary!$B$5=3,IF(C38=\"\",\"\",VLOOKUP(A38,Calendar!$A$3:$G$459,5,FALSE)),IF(C38=\"\",\"\",VLOOKUP(A38,Calendar!$A$3:$G$459,2,FALSE)))","v":""},null,null,null,null,0,null,null,""]
[null,null,{"$f":"IF(ISNA(IF(Summary!$B$5=3,IF(VLOOKUP(A39,Calendar!$A$3:$G$459,7,FALSE)=\"S\", \"\", VLOOKUP(A39,Calendar!$A$3:$G$459,7,FALSE)),IF(VLOOKUP(A39,Calendar!$A$3:$G$459,4,FALSE)=\"S\", \"\", VLOOKUP(A39,Calendar!$A$3:$G$459,4,FALSE)))),\"\",IF(Summary!$B$5=3,IF(VLOOKUP(A39,Calendar!$A$3:$G$459,7,FALSE)=\"S\", \"\", VLOOKUP(A39,Calendar!$A$3:$G$459,7,FALSE)),IF(VLOOKUP(A39,Calendar!$A$3:$G$459,4,FALSE)=\"S\", \"\", VLOOKUP(A39,Calendar!$A$3:$G$459,4,FALSE))))","v":""},{"$f":"IF(Summary!$B$5=3,IF(C39=\"\",\"\",VLOOKUP(A39,Calendar!$A$3:$G$459,5,FALSE)),IF(C39=\"\",\"\",VLOOKUP(A39,Calendar!$A$3:$G$459,2,FALSE)))","v":""},null,null,null,null,0,null,null,""]
[null,null,null,"Total Minutes",{"$f":"SUM(E9:E39)","v":0},{"$f":"SUM(F9:F39)","v":0},0,0,0,null,null,{"$f":"IF(SUM(E40:H40)>COUNTA(E9:E39)*390,\"The sum total for all cost objectives exceeds the maximum anticipated value based upon the number of days worked. Confirm minutes claimed for each day.\",\"\")","v":""}]
[null,null,null,"Total Hours",{"$f":"E40/60","v":0},{"$f":"F40/60","v":0},0,0,0]
[]
[]
[null,null,"Notes"]
[]
[]
[]
[]
[]
[]
[]
[]
[]
[]
[null,null,null,null,"Kansas State Department of Education",null,null,null,"Personnel Activity Report"]
[null,null,null,null,"Fiscal Auditing",null,null,null,"Updated 9/20/18"]
[null,null,null,null,"785-296-4976"]
[null,null,null,null,"https://www.ksde.org/Agency/Fiscal-and-Administrative-Services/Fiscal-Auditing"]
[]
[]
[null,null,"The Kansas State Department of Education does not discriminate on the basis of race, color, national origin, sex, disability, or age in its programs and activities and provides equal access to the Boy Scouts and other designated youth groups. The following person has been designated to handle inquiries regarding the nondiscrimination policies: KSDE General Counsel, Office of General Counsel, KSDE, Landon State Office Building, 900 S.W. Jackson, Suite 102, Topeka, KS 66612, (785) 296-3204."]

{"sheet":"December","index":7,"n_rows":61,"n_cols":12,"rows_kept":61,"cut":false,"hidden":false,"merged":[[1,2,1,8],[3,2,3,8],[4,2,4,8],[49,2,49,8],[44,2,44,8],[45,2,45,8],[46,2,46,8],[47,2,47,8],[48,2,48,8],[60,2,61,8],[5,2,5,8],[6,2,6,8],[2,2,2,8],[43,3,43,8]]}
[]
[]
[null,null,"Personnel Activity Report"]
[null,null,"Regular School Year"]
[null,null,"December"]
[null,null,{"$f":"IF(Summary!$E$8<>\"\",Summary!$E$8,\" \")","v":" "}]
[null,null,{"$f":"IF(Summary!$E$9<>\"\",Summary!$E$9,\" \")","v":" "}]
[null,null,"Day","Date","Special Ed","General Ed","Other","Other","Totals",null,null,{"$f":"IF(OR(AND(F8=\"\",COUNTA(F9:F39)>0),AND(G8=\"\",COUNTA(G9:G39)>0),AND(H8=\"\",COUNTA(H9:H39)>0)),\"<<< You must identify the cost objective in the column heading.\",\"\")","v":""}]
[1201,null,{"$f":"IF(ISNA(IF(Summary!$B$5=3,IF(VLOOKUP(A9,Calendar!$A$3:$G$459,7,FALSE)=\"S\", \"\", VLOOKUP(A9,Calendar!$A$3:$G$459,7,FALSE)),IF(VLOOKUP(A9,Calendar!$A$3:$G$459,4,FALSE)=\"S\", \"\", VLOOKUP(A9,Calendar!$A$3:$G$459,4,FALSE)))),\"\",IF(Summary!$B$5=3,IF(VLOOKUP(A9,Calendar!$A$3:$G$459,7,FALSE)=\"S\", \"\", VLOOKUP(A9,Calendar!$A$3:$G$459,7,FALSE)),IF(VLOOKUP(A9,Calendar!$A$3:$G$459,4,FALSE)=\"S\", \"\", VLOOKUP(A9,Calendar!$A$3:$G$459,4,FALSE))))","v":""},{"$f":"IF(Summary!$B$5=3,IF(C9=\"\",\"\",VLOOKUP(A9,Calendar!$A$3:$G$459,5,FALSE)),IF(C9=\"\",\"\",VLOOKUP(A9,Calendar!$A$3:$G$459,2,FALSE)))","v":""},null,null,null,null,{"$f":"MIN(1440,SUM(E9:H9))","v":0},null,null,{"$f":"IF(I9>390, \"<<< Day exceeds 390 minutes. Confirm reported time.\",\"\")","v":""}]
[1202,null,{"$f":"IF(ISNA(IF(Summary!$B$5=3,IF(VLOOKUP(A10,Calendar!$A$3:$G$459,7,FALSE)=\"S\", \"\", VLOOKUP(A10,Calendar!$A$3:$G$459,7,FALSE)),IF(VLOOKUP(A10,Calendar!$A$3:$G$459,4,FALSE)=\"S\", \"\", VLOOKUP(A10,Calendar!$A$3:$G$459,4,FALSE)))),\"\",IF(Summary!$B$5=3,IF(VLOOKUP(A10,Calendar!$A$3:$G$459,7,FALSE)=\"S\", \"\", VLOOKUP(A10,Calendar!$A$3:$G$459,7,FALSE)),IF(VLOOKUP(A10,Calendar!$A$3:$G$459,4,FALSE)=\"S\", \"\", VLOOKUP(A10,Calendar!$A$3:$G$459,4,FALSE))))","v":"M"},{"$f":"IF(Summary!$B$5=3,IF(C10=\"\",\"\",VLOOKUP(A10,Calendar!$A$3:$G$459,5,FALSE)),IF(C10=\"\",\"\",VLOOKUP(A10,Calendar!$A$3:$G$459,2,FALSE)))","v":"2019-12-02"},null,null,null,null,{"$f":"MIN(1440,SUM(E10:H10))","v":0},null,null,{"$f":"IF(I10>390, \"<<< Day exceeds 390 minutes. Confirm reported time.\",\"\")","v":""}]
[1203,null,{"$f":"IF(ISNA(IF(Summary!$B$5=3,IF(VLOOKUP(A11,Calendar!$A$3:$G$459,7,FALSE)=\"S\", \"\", VLOOKUP(A11,Calendar!$A$3:$G$459,7,FALSE)),IF(VLOOKUP(A11,Calendar!$A$3:$G$459,4,FALSE)=\"S\", \"\", VLOOKUP(A11,Calendar!$A$3:$G$459,4,FALSE)))),\"\",IF(Summary!$B$5=3,IF(VLOOKUP(A11,Calendar!$A$3:$G$459,7,FALSE)=\"S\", \"\", VLOOKUP(A11,Calendar!$A$3:$G$459,7,FALSE)),IF(VLOOKUP(A11,Calendar!$A$3:$G$459,4,FALSE)=\"S\", \"\", VLOOKUP(A11,Calendar!$A$3:$G$459,4,FALSE))))","v":"T"},{"$f":"IF(Summary!$B$5=3,IF(C11=\"\",\"\",VLOOKUP(A11,Calendar!$A$3:$G$459,5,FALSE)),IF(C11=\"\",\"\",VLOOKUP(A11,Calendar!$A$3:$G$459,2,FALSE)))","v":"2019-12-03"},null,null,null,null,0,null,null,""]
[1204,null,{"$f":"IF(ISNA(IF(Summary!$B$5=3,IF(VLOOKUP(A12,Calendar!$A$3:$G$459,7,FALSE)=\"S\", \"\", VLOOKUP(A12,Calendar!$A$3:$G$459,7,FALSE)),IF(VLOOKUP(A12,Calendar!$A$3:$G$459,4,FALSE)=\"S\", \"\", VLOOKUP(A12,Calendar!$A$3:$G$459,4,FALSE)))),\"\",IF(Summary!$B$5=3,IF(VLOOKUP(A12,Calendar!$A$3:$G$459,7,FALSE)=\"S\", \"\", VLOOKUP(A12,Calendar!$A$3:$G$459,7,FALSE)),IF(VLOOKUP(A12,Calendar!$A$3:$G$459,4,FALSE)=\"S\", \"\", VLOOKUP(A12,Calendar!$A$3:$G$459,4,FALSE))))","v":"W"},{"$f":"IF(Summary!$B$5=3,IF(C12=\"\",\"\",VLOOKUP(A12,Calendar!$A$3:$G$459,5,FALSE)),IF(C12=\"\",\"\",VLOOKUP(A12,Calendar!$A$3:$G$459,2,FALSE)))","v":"2019-12-04"},null,null,null,null,0,null,null,""]
[1205,null,{"$f":"IF(ISNA(IF(Summary!$B$5=3,IF(VLOOKUP(A13,Calendar!$A$3:$G$459,7,FALSE)=\"S\", \"\", VLOOKUP(A13,Calendar!$A$3:$G$459,7,FALSE)),IF(VLOOKUP(A13,Calendar!$A$3:$G$459,4,FALSE)=\"S\", \"\", VLOOKUP(A13,Calendar!$A$3:$G$459,4,FALSE)))),\"\",IF(Summary!$B$5=3,IF(VLOOKUP(A13,Calendar!$A$3:$G$459,7,FALSE)=\"S\", \"\", VLOOKUP(A13,Calendar!$A$3:$G$459,7,FALSE)),IF(VLOOKUP(A13,Calendar!$A$3:$G$459,4,FALSE)=\"S\", \"\", VLOOKUP(A13,Calendar!$A$3:$G$459,4,FALSE))))","v":"R"},{"$f":"IF(Summary!$B$5=3,IF(C13=\"\",\"\",VLOOKUP(A13,Calendar!$A$3:$G$459,5,FALSE)),IF(C13=\"\",\"\",VLOOKUP(A13,Calendar!$A$3:$G$459,2,FALSE)))","v":"2019-12-05"},null,null,null,null,0,null,null,""]
[1206,null,{"$f":"IF(ISNA(IF(Summary!$B$5=3,IF(VLOOKUP(A14,Calendar!$A$3:$G$459,7,FALSE)=\"S\", \"\", VLOOKUP(A14,Calendar!$A$3:$G$459,7,FALSE)),IF(VLOOKUP(A14,Calendar!$A$3:$G$459,4,FALSE)=\"S\", \"\", VLOOKUP(A14,Calendar!$A$3:$G$459,4,FALSE)))),\"\",IF(Summary!$B$5=3,IF(VLOOKUP(A14,Calendar!$A$3:$G$459,7,FALSE)=\"S\", \"\", VLOOKUP(A14,Calendar!$A$3:$G$459,7,FALSE)),IF(VLOOKUP(A14,Calendar!$A$3:$G$459,4,FALSE)=\"S\", \"\", VLOOKUP(A14,Calendar!$A$3:$G$459,4,FALSE))))","v":"F"},{"$f":"IF(Summary!$B$5=3,IF(C14=\"\",\"\",VLOOKUP(A14,Calendar!$A$3:$G$459,5,FALSE)),IF(C14=\"\",\"\",VLOOKUP(A14,Calendar!$A$3:$G$459,2,FALSE)))","v":"2019-12-06"},null,null,null,null,0,null,null,""]
[1207,null,{"$f":"IF(ISNA(IF(Summary!$B$5=3,IF(VLOOKUP(A15,Calendar!$A$3:$G$459,7,FALSE)=\"S\", \"\", VLOOKUP(A15,Calendar!$A$3:$G$459,7,FALSE)),IF(VLOOKUP(A15,Calendar!$A$3:$G$459,4,FALSE)=\"S\", \"\", VLOOKUP(A15,Calendar!$A$3:$G$459,4,FALSE)))),\"\",IF(Summary!$B$5=3,IF(VLOOKUP(A15,Calendar!$A$3:$G$459,7,FALSE)=\"S\", \"\", VLOOKUP(A15,Calendar!$A$3:$G$459,7,FALSE)),IF(VLOOKUP(A15,Calendar!$A$3:$G$459,4,FALSE)=\"S\", \"\", VLOOKUP(A15,Calendar!$A$3:$G$459,4,FALSE))))","v":""},{"$f":"IF(Summary!$B$5=3,IF(C15=\"\",\"\",VLOOKUP(A15,Calendar!$A$3:$G$459,5,FALSE)),IF(C15=\"\",\"\",VLOOKUP(A15,Calendar!$A$3:$G$459,2,FALSE)))","v":""},null,null,null,null,0,null,null,""]
[1208,null,{"$f":"IF(ISNA(IF(Summary!$B$5=3,IF(VLOOKUP(A16,Calendar!$A$3:$G$459,7,FALSE)=\"S\", \"\", VLOOKUP(A16,Calendar!$A$3:$G$459,7,FALSE)),IF(VLOOKUP(A16,Calendar!$A$3:$G$459,4,FALSE)=\"S\", \"\", VLOOKUP(A16,Calendar!$A$3:$G$459,4,FALSE)))),\"\",IF(Summary!$B$5=3,IF(VLOOKUP(A16,Calendar!$A$3:$G$459,7,FALSE)=\"S\", \"\", VLOOKUP(A16,Calendar!$A$3:$G$459,7,FALSE)),IF(VLOOKUP(A16,Calendar!$A$3:$G$459,4,FALSE)=\"S\", \"\", VLOOKUP(A16,Calendar!$A$3:$G$459,4,FALSE))))","v":""},{"$f":"IF(Summary!$B$5=3,IF(C16=\"\",\"\",VLOOKUP(A16,Calendar!$A$3:$G$459,5,FALSE)),IF(C16=\"\",\"\",VLOOKUP(A16,Calendar!$A$3:$G$459,2,FALSE)))","v":""},null,null,null,null,0,null,null,""]
[1209,null,{"$f":"IF(ISNA(IF(Summary!$B$5=3,IF(VLOOKUP(A17,Calendar!$A$3:$G$459,7,FALSE)=\"S\", \"\", VLOOKUP(A17,Calendar!$A$3:$G$459,7,FALSE)),IF(VLOOKUP(A17,Calendar!$A$3:$G$459,4,FALSE)=\"S\", \"\", VLOOKUP(A17,Calendar!$A$3:$G$459,4,FALSE)))),\"\",IF(Summary!$B$5=3,IF(VLOOKUP(A17,Calendar!$A$3:$G$459,7,FALSE)=\"S\", \"\", VLOOKUP(A17,Calendar!$A$3:$G$459,7,FALSE)),IF(VLOOKUP(A17,Calendar!$A$3:$G$459,4,FALSE)=\"S\", \"\", VLOOKUP(A17,Calendar!$A$3:$G$459,4,FALSE))))","v":"M"},{"$f":"IF(Summary!$B$5=3,IF(C17=\"\",\"\",VLOOKUP(A17,Calendar!$A$3:$G$459,5,FALSE)),IF(C17=\"\",\"\",VLOOKUP(A17,Calendar!$A$3:$G$459,2,FALSE)))","v":"2019-12-09"},null,null,null,null,0,null,null,""]
[1210,null,{"$f":"IF(ISNA(IF(Summary!$B$5=3,IF(VLOOKUP(A18,Calendar!$A$3:$G$459,7,FALSE)=\"S\", \"\", VLOOKUP(A18,Calendar!$A$3:$G$459,7,FALSE)),IF(VLOOKUP(A18,Calendar!$A$3:$G$459,4,FALSE)=\"S\", \"\", VLOOKUP(A18,Calendar!$A$3:$G$459,4,FALSE)))),\"\",IF(Summary!$B$5=3,IF(VLOOKUP(A18,Calendar!$A$3:$G$459,7,FALSE)=\"S\", \"\", VLOOKUP(A18,Calendar!$A$3:$G$459,7,FALSE)),IF(VLOOKUP(A18,Calendar!$A$3:$G$459,4,FALSE)=\"S\", \"\", VLOOKUP(A18,Calendar!$A$3:$G$459,4,FALSE))))","v":"T"},{"$f":"IF(Summary!$B$5=3,IF(C18=\"\",\"\",VLOOKUP(A18,Calendar!$A$3:$G$459,5,FALSE)),IF(C18=\"\",\"\",VLOOKUP(A18,Calendar!$A$3:$G$459,2,FALSE)))","v":"2019-12-10"},null,null,null,null,0,null,null,""]
[1211,null,{"$f":"IF(ISNA(IF(Summary!$B$5=3,IF(VLOOKUP(A19,Calendar!$A$3:$G$459,7,FALSE)=\"S\", \"\", VLOOKUP(A19,Calendar!$A$3:$G$459,7,FALSE)),IF(VLOOKUP(A19,Calendar!$A$3:$G$459,4,FALSE)=\"S\", \"\", VLOOKUP(A19,Calendar!$A$3:$G$459,4,FALSE)))),\"\",IF(Summary!$B$5=3,IF(VLOOKUP(A19,Calendar!$A$3:$G$459,7,FALSE)=\"S\", \"\", VLOOKUP(A19,Calendar!$A$3:$G$459,7,FALSE)),IF(VLOOKUP(A19,Calendar!$A$3:$G$459,4,FALSE)=\"S\", \"\", VLOOKUP(A19,Calendar!$A$3:$G$459,4,FALSE))))","v":"W"},{"$f":"IF(Summary!$B$5=3,IF(C19=\"\",\"\",VLOOKUP(A19,Calendar!$A$3:$G$459,5,FALSE)),IF(C19=\"\",\"\",VLOOKUP(A19,Calendar!$A$3:$G$459,2,FALSE)))","v":"2019-12-11"},null,null,null,null,0,null,null,""]
[1212,null,{"$f":"IF(ISNA(IF(Summary!$B$5=3,IF(VLOOKUP(A20,Calendar!$A$3:$G$459,7,FALSE)=\"S\", \"\", VLOOKUP(A20,Calendar!$A$3:$G$459,7,FALSE)),IF(VLOOKUP(A20,Calendar!$A$3:$G$459,4,FALSE)=\"S\", \"\", VLOOKUP(A20,Calendar!$A$3:$G$459,4,FALSE)))),\"\",IF(Summary!$B$5=3,IF(VLOOKUP(A20,Calendar!$A$3:$G$459,7,FALSE)=\"S\", \"\", VLOOKUP(A20,Calendar!$A$3:$G$459,7,FALSE)),IF(VLOOKUP(A20,Calendar!$A$3:$G$459,4,FALSE)=\"S\", \"\", VLOOKUP(A20,Calendar!$A$3:$G$459,4,FALSE))))","v":"R"},{"$f":"IF(Summary!$B$5=3,IF(C20=\"\",\"\",VLOOKUP(A20,Calendar!$A$3:$G$459,5,FALSE)),IF(C20=\"\",\"\",VLOOKUP(A20,Calendar!$A$3:$G$459,2,FALSE)))","v":"2019-12-12"},null,null,null,null,0,null,null,""]
[1213,null,{"$f":"IF(ISNA(IF(Summary!$B$5=3,IF(VLOOKUP(A21,Calendar!$A$3:$G$459,7,FALSE)=\"S\", \"\", VLOOKUP(A21,Calendar!$A$3:$G$459,7,FALSE)),IF(VLOOKUP(A21,Calendar!$A$3:$G$459,4,FALSE)=\"S\", \"\", VLOOKUP(A21,Calendar!$A$3:$G$459,4,FALSE)))),\"\",IF(Summary!$B$5=3,IF(VLOOKUP(A21,Calendar!$A$3:$G$459,7,FALSE)=\"S\", \"\", VLOOKUP(A21,Calendar!$A$3:$G$459,7,FALSE)),IF(VLOOKUP(A21,Calendar!$A$3:$G$459,4,FALSE)=\"S\", \"\", VLOOKUP(A21,Calendar!$A$3:$G$459,4,FALSE))))","v":"F"},{"$f":"IF(Summary!$B$5=3,IF(C21=\"\",\"\",VLOOKUP(A21,Calendar!$A$3:$G$459,5,FALSE)),IF(C21=\"\",\"\",VLOOKUP(A21,Calendar!$A$3:$G$459,2,FALSE)))","v":"2019-12-13"},null,null,null,null,0,null,null,""]
[1214,null,{"$f":"IF(ISNA(IF(Summary!$B$5=3,IF(VLOOKUP(A22,Calendar!$A$3:$G$459,7,FALSE)=\"S\", \"\", VLOOKUP(A22,Calendar!$A$3:$G$459,7,FALSE)),IF(VLOOKUP(A22,Calendar!$A$3:$G$459,4,FALSE)=\"S\", \"\", VLOOKUP(A22,Calendar!$A$3:$G$459,4,FALSE)))),\"\",IF(Summary!$B$5=3,IF(VLOOKUP(A22,Calendar!$A$3:$G$459,7,FALSE)=\"S\", \"\", VLOOKUP(A22,Calendar!$A$3:$G$459,7,FALSE)),IF(VLOOKUP(A22,Calendar!$A$3:$G$459,4,FALSE)=\"S\", \"\", VLOOKUP(A22,Calendar!$A$3:$G$459,4,FALSE))))","v":""},{"$f":"IF(Summary!$B$5=3,IF(C22=\"\",\"\",VLOOKUP(A22,Calendar!$A$3:$G$459,5,FALSE)),IF(C22=\"\",\"\",VLOOKUP(A22,Calendar!$A$3:$G$459,2,FALSE)))","v":""},null,null,null,null,0,null,null,""]
[1215,null,{"$f":"IF(ISNA(IF(Summary!$B$5=3,IF(VLOOKUP(A23,Calendar!$A$3:$G$459,7,FALSE)=\"S\", \"\", VLOOKUP(A23,Calendar!$A$3:$G$459,7,FALSE)),IF(VLOOKUP(A23,Calendar!$A$3:$G$459,4,FALSE)=\"S\", \"\", VLOOKUP(A23,Calendar!$A$3:$G$459,4,FALSE)))),\"\",IF(Summary!$B$5=3,IF(VLOOKUP(A23,Calendar!$A$3:$G$459,7,FALSE)=\"S\", \"\", VLOOKUP(A23,Calendar!$A$3:$G$459,7,FALSE)),IF(VLOOKUP(A23,Calendar!$A$3:$G$459,4,FALSE)=\"S\", \"\", VLOOKUP(A23,Calendar!$A$3:$G$459,4,FALSE))))","v":""},{"$f":"IF(Summary!$B$5=3,IF(C23=\"\",\"\",VLOOKUP(A23,Calendar!$A$3:$G$459,5,FALSE)),IF(C23=\"\",\"\",VLOOKUP(A23,Calendar!$A$3:$G$459,2,FALSE)))","v":""},null,null,null,null,0,null,null,""]
[1216,null,{"$f":"IF(ISNA(IF(Summary!$B$5=3,IF(VLOOKUP(A24,Calendar!$A$3:$G$459,7,FALSE)=\"S\", \"\", VLOOKUP(A24,Calendar!$A$3:$G$459,7,FALSE)),IF(VLOOKUP(A24,Calendar!$A$3:$G$459,4,FALSE)=\"S\", \"\", VLOOKUP(A24,Calendar!$A$3:$G$459,4,FALSE)))),\"\",IF(Summary!$B$5=3,IF(VLOOKUP(A24,Calendar!$A$3:$G$459,7,FALSE)=\"S\", \"\", VLOOKUP(A24,Calendar!$A$3:$G$459,7,FALSE)),IF(VLOOKUP(A24,Calendar!$A$3:$G$459,4,FALSE)=\"S\", \"\", VLOOKUP(A24,Calendar!$A$3:$G$459,4,FALSE))))","v":"M"},{"$f":"IF(Summary!$B$5=3,IF(C24=\"\",\"\",VLOOKUP(A24,Calendar!$A$3:$G$459,5,FALSE)),IF(C24=\"\",\"\",VLOOKUP(A24,Calendar!$A$3:$G$459,2,FALSE)))","v":"2019-12-16"},null,null,null,null,0,null,null,""]
[1217,null,{"$f":"IF(ISNA(IF(Summary!$B$5=3,IF(VLOOKUP(A25,Calendar!$A$3:$G$459,7,FALSE)=\"S\", \"\", VLOOKUP(A25,Calendar!$A$3:$G$459,7,FALSE)),IF(VLOOKUP(A25,Calendar!$A$3:$G$459,4,FALSE)=\"S\", \"\", VLOOKUP(A25,Calendar!$A$3:$G$459,4,FALSE)))),\"\",IF(Summary!$B$5=3,IF(VLOOKUP(A25,Calendar!$A$3:$G$459,7,FALSE)=\"S\", \"\", VLOOKUP(A25,Calendar!$A$3:$G$459,7,FALSE)),IF(VLOOKUP(A25,Calendar!$A$3:$G$459,4,FALSE)=\"S\", \"\", VLOOKUP(A25,Calendar!$A$3:$G$459,4,FALSE))))","v":"T"},{"$f":"IF(Summary!$B$5=3,IF(C25=\"\",\"\",VLOOKUP(A25,Calendar!$A$3:$G$459,5,FALSE)),IF(C25=\"\",\"\",VLOOKUP(A25,Calendar!$A$3:$G$459,2,FALSE)))","v":"2019-12-17"},null,null,null,null,0,null,null,""]
[1218,null,{"$f":"IF(ISNA(IF(Summary!$B$5=3,IF(VLOOKUP(A26,Calendar!$A$3:$G$459,7,FALSE)=\"S\", \"\", VLOOKUP(A26,Calendar!$A$3:$G$459,7,FALSE)),IF(VLOOKUP(A26,Calendar!$A$3:$G$459,4,FALSE)=\"S\", \"\", VLOOKUP(A26,Calendar!$A$3:$G$459,4,FALSE)))),\"\",IF(Summary!$B$5=3,IF(VLOOKUP(A26,Calendar!$A$3:$G$459,7,FALSE)=\"S\", \"\", VLOOKUP(A26,Calendar!$A$3:$G$459,7,FALSE)),IF(VLOOKUP(A26,Calendar!$A$3:$G$459,4,FALSE)=\"S\", \"\", VLOOKUP(A26,Calendar!$A$3:$G$459,4,FALSE))))","v":"W"},{"$f":"IF(Summary!$B$5=3,IF(C26=\"\",\"\",VLOOKUP(A26,Calendar!$A$3:$G$459,5,FALSE)),IF(C26=\"\",\"\",VLOOKUP(A26,Calendar!$A$3:$G$459,2,FALSE)))","v":"2019-12-18"},null,null,null,null,0,null,null,""]
[1219,null,{"$f":"IF(ISNA(IF(Summary!$B$5=3,IF(VLOOKUP(A27,Calendar!$A$3:$G$459,7,FALSE)=\"S\", \"\", VLOOKUP(A27,Calendar!$A$3:$G$459,7,FALSE)),IF(VLOOKUP(A27,Calendar!$A$3:$G$459,4,FALSE)=\"S\", \"\", VLOOKUP(A27,Calendar!$A$3:$G$459,4,FALSE)))),\"\",IF(Summary!$B$5=3,IF(VLOOKUP(A27,Calendar!$A$3:$G$459,7,FALSE)=\"S\", \"\", VLOOKUP(A27,Calendar!$A$3:$G$459,7,FALSE)),IF(VLOOKUP(A27,Calendar!$A$3:$G$459,4,FALSE)=\"S\", \"\", VLOOKUP(A27,Calendar!$A$3:$G$459,4,FALSE))))","v":"R"},{"$f":"IF(Summary!$B$5=3,IF(C27=\"\",\"\",VLOOKUP(A27,Calendar!$A$3:$G$459,5,FALSE)),IF(C27=\"\",\"\",VLOOKUP(A27,Calendar!$A$3:$G$459,2,FALSE)))","v":"2019-12-19"},null,null,null,null,0,null,null,""]
[1220,null,{"$f":"IF(ISNA(IF(Summary!$B$5=3,IF(VLOOKUP(A28,Calendar!$A$3:$G$459,7,FALSE)=\"S\", \"\", VLOOKUP(A28,Calendar!$A$3:$G$459,7,FALSE)),IF(VLOOKUP(A28,Calendar!$A$3:$G$459,4,FALSE)=\"S\", \"\", VLOOKUP(A28,Calendar!$A$3:$G$459,4,FALSE)))),\"\",IF(Summary!$B$5=3,IF(VLOOKUP(A28,Calendar!$A$3:$G$459,7,FALSE)=\"S\", \"\", VLOOKUP(A28,Calendar!$A$3:$G$459,7,FALSE)),IF(VLOOKUP(A28,Calendar!$A$3:$G$459,4,FALSE)=\"S\", \"\", VLOOKUP(A28,Calendar!$A$3:$G$459,4,FALSE))))","v":"F"},{"$f":"IF(Summary!$B$5=3,IF(C28=\"\",\"\",VLOOKUP(A28,Calendar!$A$3:$G$459,5,FALSE)),IF(C28=\"\",\"\",VLOOKUP(A28,Calendar!$A$3:$G$459,2,FALSE)))","v":"2019-12-20"},null,null,null,null,0,null,null,""]
[1221,null,{"$f":"IF(ISNA(IF(Summary!$B$5=3,IF(VLOOKUP(A29,Calendar!$A$3:$G$459,7,FALSE)=\"S\", \"\", VLOOKUP(A29,Calendar!$A$3:$G$459,7,FALSE)),IF(VLOOKUP(A29,Calendar!$A$3:$G$459,4,FALSE)=\"S\", \"\", VLOOKUP(A29,Calendar!$A$3:$G$459,4,FALSE)))),\"\",IF(Summary!$B$5=3,IF(VLOOKUP(A29,Calendar!$A$3:$G$459,7,FALSE)=\"S\", \"\", VLOOKUP(A29,Calendar!$A$3:$G$459,7,FALSE)),IF(VLOOKUP(A29,Calendar!$A$3:$G$459,4,FALSE)=\"S\", \"\", VLOOKUP(A29,Calendar!$A$3:$G$459,4,FALSE))))","v":""},{"$f":"IF(Summary!$B$5=3,IF(C29=\"\",\"\",VLOOKUP(A29,Calendar!$A$3:$G$459,5,FALSE)),IF(C29=\"\",\"\",VLOOKUP(A29,Calendar!$A$3:$G$459,2,FALSE)))","v":""},null,null,null,null,0,null,null,""]
[1222,null,{"$f":"IF(ISNA(IF(Summary!$B$5=3,IF(VLOOKUP(A30,Calendar!$A$3:$G$459,7,FALSE)=\"S\", \"\", VLOOKUP(A30,Calendar!$A$3:$G$459,7,FALSE)),IF(VLOOKUP(A30,Calendar!$A$3:$G$459,4,FALSE)=\"S\", \"\", VLOOKUP(A30,Calendar!$A$3:$G$459,4,FALSE)))),\"\",IF(Summary!$B$5=3,IF(VLOOKUP(A30,Calendar!$A$3:$G$459,7,FALSE)=\"S\", \"\", VLOOKUP(A30,Calendar!$A$3:$G$459,7,FALSE)),IF(VLOOKUP(A30,Calendar!$A$3:$G$459,4,FALSE)=\"S\", \"\", VLOOKUP(A30,Calendar!$A$3:$G$459,4,FALSE))))","v":""},{"$f":"IF(Summary!$B$5=3,IF(C30=\"\",\"\",VLOOKUP(A30,Calendar!$A$3:$G$459,5,FALSE)),IF(C30=\"\",\"\",VLOOKUP(A30,Calendar!$A$3:$G$459,2,FALSE)))","v":""},null,null,null,null,0,null,null,""]
[1223,null,{"$f":"IF(ISNA(IF(Summary!$B$5=3,IF(VLOOKUP(A31,Calendar!$A$3:$G$459,7,FALSE)=\"S\", \"\", VLOOKUP(A31,Calendar!$A$3:$G$459,7,FALSE)),IF(VLOOKUP(A31,Calendar!$A$3:$G$459,4,FALSE)=\"S\", \"\", VLOOKUP(A31,Calendar!$A$3:$G$459,4,FALSE)))),\"\",IF(Summary!$B$5=3,IF(VLOOKUP(A31,Calendar!$A$3:$G$459,7,FALSE)=\"S\", \"\", VLOOKUP(A31,Calendar!$A$3:$G$459,7,FALSE)),IF(VLOOKUP(A31,Calendar!$A$3:$G$459,4,FALSE)=\"S\", \"\", VLOOKUP(A31,Calendar!$A$3:$G$459,4,FALSE))))","v":"M"},{"$f":"IF(Summary!$B$5=3,IF(C31=\"\",\"\",VLOOKUP(A31,Calendar!$A$3:$G$459,5,FALSE)),IF(C31=\"\",\"\",VLOOKUP(A31,Calendar!$A$3:$G$459,2,FALSE)))","v":"2019-12-23"},null,null,null,null,0,null,null,""]
[1224,null,{"$f":"IF(ISNA(IF(Summary!$B$5=3,IF(VLOOKUP(A32,Calendar!$A$3:$G$459,7,FALSE)=\"S\", \"\", VLOOKUP(A32,Calendar!$A$3:$G$459,7,FALSE)),IF(VLOOKUP(A32,Calendar!$A$3:$G$459,4,FALSE)=\"S\", \"\", VLOOKUP(A32,Calendar!$A$3:$G$459,4,FALSE)))),\"\",IF(Summary!$B$5=3,IF(VLOOKUP(A32,Calendar!$A$3:$G$459,7,FALSE)=\"S\", \"\", VLOOKUP(A32,Calendar!$A$3:$G$459,7,FALSE)),IF(VLOOKUP(A32,Calendar!$A$3:$G$459,4,FALSE)=\"S\", \"\", VLOOKUP(A32,Calendar!$A$3:$G$459,4,FALSE))))","v":"T"},{"$f":"IF(Summary!$B$5=3,IF(C32=\"\",\"\",VLOOKUP(A32,Calendar!$A$3:$G$459,5,FALSE)),IF(C32=\"\",\"\",VLOOKUP(A32,Calendar!$A$3:$G$459,2,FALSE)))","v":"2019-12-24"},null,null,null,null,0,null,null,""]
[1225,null,{"$f":"IF(ISNA(IF(Summary!$B$5=3,IF(VLOOKUP(A33,Calendar!$A$3:$G$459,7,FALSE)=\"S\", \"\", VLOOKUP(A33,Calendar!$A$3:$G$459,7,FALSE)),IF(VLOOKUP(A33,Calendar!$A$3:$G$459,4,FALSE)=\"S\", \"\", VLOOKUP(A33,Calendar!$A$3:$G$459,4,FALSE)))),\"\",IF(Summary!$B$5=3,IF(VLOOKUP(A33,Calendar!$A$3:$G$459,7,FALSE)=\"S\", \"\", VLOOKUP(A33,Calendar!$A$3:$G$459,7,FALSE)),IF(VLOOKUP(A33,Calendar!$A$3:$G$459,4,FALSE)=\"S\", \"\", VLOOKUP(A33,Calendar!$A$3:$G$459,4,FALSE))))","v":"W"},{"$f":"IF(Summary!$B$5=3,IF(C33=\"\",\"\",VLOOKUP(A33,Calendar!$A$3:$G$459,5,FALSE)),IF(C33=\"\",\"\",VLOOKUP(A33,Calendar!$A$3:$G$459,2,FALSE)))","v":"2019-12-25"},null,null,null,null,0,null,null,""]
[1226,null,{"$f":"IF(ISNA(IF(Summary!$B$5=3,IF(VLOOKUP(A34,Calendar!$A$3:$G$459,7,FALSE)=\"S\", \"\", VLOOKUP(A34,Calendar!$A$3:$G$459,7,FALSE)),IF(VLOOKUP(A34,Calendar!$A$3:$G$459,4,FALSE)=\"S\", \"\", VLOOKUP(A34,Calendar!$A$3:$G$459,4,FALSE)))),\"\",IF(Summary!$B$5=3,IF(VLOOKUP(A34,Calendar!$A$3:$G$459,7,FALSE)=\"S\", \"\", VLOOKUP(A34,Calendar!$A$3:$G$459,7,FALSE)),IF(VLOOKUP(A34,Calendar!$A$3:$G$459,4,FALSE)=\"S\", \"\", VLOOKUP(A34,Calendar!$A$3:$G$459,4,FALSE))))","v":"R"},{"$f":"IF(Summary!$B$5=3,IF(C34=\"\",\"\",VLOOKUP(A34,Calendar!$A$3:$G$459,5,FALSE)),IF(C34=\"\",\"\",VLOOKUP(A34,Calendar!$A$3:$G$459,2,FALSE)))","v":"2019-12-26"},null,null,null,null,0,null,null,""]
[1227,null,{"$f":"IF(ISNA(IF(Summary!$B$5=3,IF(VLOOKUP(A35,Calendar!$A$3:$G$459,7,FALSE)=\"S\", \"\", VLOOKUP(A35,Calendar!$A$3:$G$459,7,FALSE)),IF(VLOOKUP(A35,Calendar!$A$3:$G$459,4,FALSE)=\"S\", \"\", VLOOKUP(A35,Calendar!$A$3:$G$459,4,FALSE)))),\"\",IF(Summary!$B$5=3,IF(VLOOKUP(A35,Calendar!$A$3:$G$459,7,FALSE)=\"S\", \"\", VLOOKUP(A35,Calendar!$A$3:$G$459,7,FALSE)),IF(VLOOKUP(A35,Calendar!$A$3:$G$459,4,FALSE)=\"S\", \"\", VLOOKUP(A35,Calendar!$A$3:$G$459,4,FALSE))))","v":"F"},{"$f":"IF(Summary!$B$5=3,IF(C35=\"\",\"\",VLOOKUP(A35,Calendar!$A$3:$G$459,5,FALSE)),IF(C35=\"\",\"\",VLOOKUP(A35,Calendar!$A$3:$G$459,2,FALSE)))","v":"2019-12-27"},null,null,null,null,0,null,null,""]
[1228,null,{"$f":"IF(ISNA(IF(Summary!$B$5=3,IF(VLOOKUP(A36,Calendar!$A$3:$G$459,7,FALSE)=\"S\", \"\", VLOOKUP(A36,Calendar!$A$3:$G$459,7,FALSE)),IF(VLOOKUP(A36,Calendar!$A$3:$G$459,4,FALSE)=\"S\", \"\", VLOOKUP(A36,Calendar!$A$3:$G$459,4,FALSE)))),\"\",IF(Summary!$B$5=3,IF(VLOOKUP(A36,Calendar!$A$3:$G$459,7,FALSE)=\"S\", \"\", VLOOKUP(A36,Calendar!$A$3:$G$459,7,FALSE)),IF(VLOOKUP(A36,Calendar!$A$3:$G$459,4,FALSE)=\"S\", \"\", VLOOKUP(A36,Calendar!$A$3:$G$459,4,FALSE))))","v":""},{"$f":"IF(Summary!$B$5=3,IF(C36=\"\",\"\",VLOOKUP(A36,Calendar!$A$3:$G$459,5,FALSE)),IF(C36=\"\",\"\",VLOOKUP(A36,Calendar!$A$3:$G$459,2,FALSE)))","v":""},null,null,null,null,0,null,null,""]
[1229,null,{"$f":"IF(ISNA(IF(Summary!$B$5=3,IF(VLOOKUP(A37,Calendar!$A$3:$G$459,7,FALSE)=\"S\", \"\", VLOOKUP(A37,Calendar!$A$3:$G$459,7,FALSE)),IF(VLOOKUP(A37,Calendar!$A$3:$G$459,4,FALSE)=\"S\", \"\", VLOOKUP(A37,Calendar!$A$3:$G$459,4,FALSE)))),\"\",IF(Summary!$B$5=3,IF(VLOOKUP(A37,Calendar!$A$3:$G$459,7,FALSE)=\"S\", \"\", VLOOKUP(A37,Calendar!$A$3:$G$459,7,FALSE)),IF(VLOOKUP(A37,Calendar!$A$3:$G$459,4,FALSE)=\"S\", \"\", VLOOKUP(A37,Calendar!$A$3:$G$459,4,FALSE))))","v":""},{"$f":"IF(Summary!$B$5=3,IF(C37=\"\",\"\",VLOOKUP(A37,Calendar!$A$3:$G$459,5,FALSE)),IF(C37=\"\",\"\",VLOOKUP(A37,Calendar!$A$3:$G$459,2,FALSE)))","v":""},null,null,null,null,0,null,null,""]
[1230,null,{"$f":"IF(ISNA(IF(Summary!$B$5=3,IF(VLOOKUP(A38,Calendar!$A$3:$G$459,7,FALSE)=\"S\", \"\", VLOOKUP(A38,Calendar!$A$3:$G$459,7,FALSE)),IF(VLOOKUP(A38,Calendar!$A$3:$G$459,4,FALSE)=\"S\", \"\", VLOOKUP(A38,Calendar!$A$3:$G$459,4,FALSE)))),\"\",IF(Summary!$B$5=3,IF(VLOOKUP(A38,Calendar!$A$3:$G$459,7,FALSE)=\"S\", \"\", VLOOKUP(A38,Calendar!$A$3:$G$459,7,FALSE)),IF(VLOOKUP(A38,Calendar!$A$3:$G$459,4,FALSE)=\"S\", \"\", VLOOKUP(A38,Calendar!$A$3:$G$459,4,FALSE))))","v":"M"},{"$f":"IF(Summary!$B$5=3,IF(C38=\"\",\"\",VLOOKUP(A38,Calendar!$A$3:$G$459,5,FALSE)),IF(C38=\"\",\"\",VLOOKUP(A38,Calendar!$A$3:$G$459,2,FALSE)))","v":"2019-12-30"},null,null,null,null,0,null,null,""]
[1231,null,{"$f":"IF(ISNA(IF(Summary!$B$5=3,IF(VLOOKUP(A39,Calendar!$A$3:$G$459,7,FALSE)=\"S\", \"\", VLOOKUP(A39,Calendar!$A$3:$G$459,7,FALSE)),IF(VLOOKUP(A39,Calendar!$A$3:$G$459,4,FALSE)=\"S\", \"\", VLOOKUP(A39,Calendar!$A$3:$G$459,4,FALSE)))),\"\",IF(Summary!$B$5=3,IF(VLOOKUP(A39,Calendar!$A$3:$G$459,7,FALSE)=\"S\", \"\", VLOOKUP(A39,Calendar!$A$3:$G$459,7,FALSE)),IF(VLOOKUP(A39,Calendar!$A$3:$G$459,4,FALSE)=\"S\", \"\", VLOOKUP(A39,Calendar!$A$3:$G$459,4,FALSE))))","v":"T"},{"$f":"IF(Summary!$B$5=3,IF(C39=\"\",\"\",VLOOKUP(A39,Calendar!$A$3:$G$459,5,FALSE)),IF(C39=\"\",\"\",VLOOKUP(A39,Calendar!$A$3:$G$459,2,FALSE)))","v":"2019-12-31"},null,null,null,null,0,null,null,""]
[null,null,null,"Total Minutes",{"$f":"SUM(E9:E39)","v":0},{"$f":"SUM(F9:F39)","v":0},0,0,0,null,null,{"$f":"IF(SUM(E40:H40)>COUNTA(E9:E39)*390,\"The sum total for all cost objectives exceeds the maximum anticipated value based upon the number of days worked. Confirm minutes claimed for each day.\",\"\")","v":""}]
[null,null,null,"Total Hours",{"$f":"E40/60","v":0},{"$f":"F40/60","v":0},0,0,0]
[]
[]
[null,null,"Notes"]
[]
[]
[]
[]
[]
[]
[]
[]
[]
[]
[null,null,null,null,"Kansas State Department of Education",null,null,null,"Personnel Activity Report"]
[null,null,null,null,"Fiscal Auditing",null,null,null,"Updated 9/20/18"]
[null,null,null,null,"785-296-4976"]
[null,null,null,null,"https://www.ksde.org/Agency/Fiscal-and-Administrative-Services/Fiscal-Auditing"]
[]
[]
[null,null,"The Kansas State Department of Education does not discriminate on the basis of race, color, national origin, sex, disability, or age in its programs and activities and provides equal access to the Boy Scouts and other designated youth groups. The following person has been designated to handle inquiries regarding the nondiscrimination policies: KSDE General Counsel, Office of General Counsel, KSDE, Landon State Office Building, 900 S.W. Jackson, Suite 102, Topeka, KS 66612, (785) 296-3204."]

{"sheet":"January","index":8,"n_rows":61,"n_cols":12,"rows_kept":61,"cut":false,"hidden":false,"merged":[[60,2,61,8],[1,2,1,8],[2,2,2,8],[3,2,3,8],[4,2,4,8],[46,2,46,8],[47,2,47,8],[48,2,48,8],[49,2,49,8],[5,2,5,8],[6,2,6,8],[43,3,43,8],[44,2,44,8],[45,2,45,8]]}
[]
[]
[null,null,"Personnel Activity Report"]
[null,null,"Regular School Year"]
[null,null,"January"]
[null,null,{"$f":"IF(Summary!$E$8<>\"\",Summary!$E$8,\" \")","v":" "}]
[null,null,{"$f":"IF(Summary!$E$9<>\"\",Summary!$E$9,\" \")","v":" "}]
[null,null,"Day","Date","Special Ed","General Ed","Other","Other","Totals",null,null,{"$f":"IF(OR(AND(F8=\"\",COUNTA(F9:F39)>0),AND(G8=\"\",COUNTA(G9:G39)>0),AND(H8=\"\",COUNTA(H9:H39)>0)),\"<<< You must identify the cost objective in the column heading.\",\"\")","v":""}]
[101,null,{"$f":"IF(ISNA(IF(Summary!$B$5=3,IF(VLOOKUP(A9,Calendar!$A$3:$G$459,7,FALSE)=\"S\", \"\", VLOOKUP(A9,Calendar!$A$3:$G$459,7,FALSE)),IF(VLOOKUP(A9,Calendar!$A$3:$G$459,4,FALSE)=\"S\", \"\", VLOOKUP(A9,Calendar!$A$3:$G$459,4,FALSE)))),\"\",IF(Summary!$B$5=3,IF(VLOOKUP(A9,Calendar!$A$3:$G$459,7,FALSE)=\"S\", \"\", VLOOKUP(A9,Calendar!$A$3:$G$459,7,FALSE)),IF(VLOOKUP(A9,Calendar!$A$3:$G$459,4,FALSE)=\"S\", \"\", VLOOKUP(A9,Calendar!$A$3:$G$459,4,FALSE))))","v":"W"},{"$f":"IF(Summary!$B$5=3,IF(C9=\"\",\"\",VLOOKUP(A9,Calendar!$A$3:$G$459,5,FALSE)),IF(C9=\"\",\"\",VLOOKUP(A9,Calendar!$A$3:$G$459,2,FALSE)))","v":"2020-01-01"},null,null,null,null,{"$f":"MIN(1440,SUM(E9:H9))","v":0},null,null,{"$f":"IF(I9>390, \"<<< Day exceeds 390 minutes. Confirm reported time.\",\"\")","v":""}]
[102,null,{"$f":"IF(ISNA(IF(Summary!$B$5=3,IF(VLOOKUP(A10,Calendar!$A$3:$G$459,7,FALSE)=\"S\", \"\", VLOOKUP(A10,Calendar!$A$3:$G$459,7,FALSE)),IF(VLOOKUP(A10,Calendar!$A$3:$G$459,4,FALSE)=\"S\", \"\", VLOOKUP(A10,Calendar!$A$3:$G$459,4,FALSE)))),\"\",IF(Summary!$B$5=3,IF(VLOOKUP(A10,Calendar!$A$3:$G$459,7,FALSE)=\"S\", \"\", VLOOKUP(A10,Calendar!$A$3:$G$459,7,FALSE)),IF(VLOOKUP(A10,Calendar!$A$3:$G$459,4,FALSE)=\"S\", \"\", VLOOKUP(A10,Calendar!$A$3:$G$459,4,FALSE))))","v":"R"},{"$f":"IF(Summary!$B$5=3,IF(C10=\"\",\"\",VLOOKUP(A10,Calendar!$A$3:$G$459,5,FALSE)),IF(C10=\"\",\"\",VLOOKUP(A10,Calendar!$A$3:$G$459,2,FALSE)))","v":"2020-01-02"},null,null,null,null,{"$f":"MIN(1440,SUM(E10:H10))","v":0},null,null,{"$f":"IF(I10>390, \"<<< Day exceeds 390 minutes. Confirm reported time.\",\"\")","v":""}]
[103,null,{"$f":"IF(ISNA(IF(Summary!$B$5=3,IF(VLOOKUP(A11,Calendar!$A$3:$G$459,7,FALSE)=\"S\", \"\", VLOOKUP(A11,Calendar!$A$3:$G$459,7,FALSE)),IF(VLOOKUP(A11,Calendar!$A$3:$G$459,4,FALSE)=\"S\", \"\", VLOOKUP(A11,Calendar!$A$3:$G$459,4,FALSE)))),\"\",IF(Summary!$B$5=3,IF(VLOOKUP(A11,Calendar!$A$3:$G$459,7,FALSE)=\"S\", \"\", VLOOKUP(A11,Calendar!$A$3:$G$459,7,FALSE)),IF(VLOOKUP(A11,Calendar!$A$3:$G$459,4,FALSE)=\"S\", \"\", VLOOKUP(A11,Calendar!$A$3:$G$459,4,FALSE))))","v":"F"},{"$f":"IF(Summary!$B$5=3,IF(C11=\"\",\"\",VLOOKUP(A11,Calendar!$A$3:$G$459,5,FALSE)),IF(C11=\"\",\"\",VLOOKUP(A11,Calendar!$A$3:$G$459,2,FALSE)))","v":"2020-01-03"},null,null,null,null,0,null,null,""]
[104,null,{"$f":"IF(ISNA(IF(Summary!$B$5=3,IF(VLOOKUP(A12,Calendar!$A$3:$G$459,7,FALSE)=\"S\", \"\", VLOOKUP(A12,Calendar!$A$3:$G$459,7,FALSE)),IF(VLOOKUP(A12,Calendar!$A$3:$G$459,4,FALSE)=\"S\", \"\", VLOOKUP(A12,Calendar!$A$3:$G$459,4,FALSE)))),\"\",IF(Summary!$B$5=3,IF(VLOOKUP(A12,Calendar!$A$3:$G$459,7,FALSE)=\"S\", \"\", VLOOKUP(A12,Calendar!$A$3:$G$459,7,FALSE)),IF(VLOOKUP(A12,Calendar!$A$3:$G$459,4,FALSE)=\"S\", \"\", VLOOKUP(A12,Calendar!$A$3:$G$459,4,FALSE))))","v":""},{"$f":"IF(Summary!$B$5=3,IF(C12=\"\",\"\",VLOOKUP(A12,Calendar!$A$3:$G$459,5,FALSE)),IF(C12=\"\",\"\",VLOOKUP(A12,Calendar!$A$3:$G$459,2,FALSE)))","v":""},null,null,null,null,0,null,null,""]
[105,null,{"$f":"IF(ISNA(IF(Summary!$B$5=3,IF(VLOOKUP(A13,Calendar!$A$3:$G$459,7,FALSE)=\"S\", \"\", VLOOKUP(A13,Calendar!$A$3:$G$459,7,FALSE)),IF(VLOOKUP(A13,Calendar!$A$3:$G$459,4,FALSE)=\"S\", \"\", VLOOKUP(A13,Calendar!$A$3:$G$459,4,FALSE)))),\"\",IF(Summary!$B$5=3,IF(VLOOKUP(A13,Calendar!$A$3:$G$459,7,FALSE)=\"S\", \"\", VLOOKUP(A13,Calendar!$A$3:$G$459,7,FALSE)),IF(VLOOKUP(A13,Calendar!$A$3:$G$459,4,FALSE)=\"S\", \"\", VLOOKUP(A13,Calendar!$A$3:$G$459,4,FALSE))))","v":""},{"$f":"IF(Summary!$B$5=3,IF(C13=\"\",\"\",VLOOKUP(A13,Calendar!$A$3:$G$459,5,FALSE)),IF(C13=\"\",\"\",VLOOKUP(A13,Calendar!$A$3:$G$459,2,FALSE)))","v":""},null,null,null,null,0,null,null,""]
[106,null,{"$f":"IF(ISNA(IF(Summary!$B$5=3,IF(VLOOKUP(A14,Calendar!$A$3:$G$459,7,FALSE)=\"S\", \"\", VLOOKUP(A14,Calendar!$A$3:$G$459,7,FALSE)),IF(VLOOKUP(A14,Calendar!$A$3:$G$459,4,FALSE)=\"S\", \"\", VLOOKUP(A14,Calendar!$A$3:$G$459,4,FALSE)))),\"\",IF(Summary!$B$5=3,IF(VLOOKUP(A14,Calendar!$A$3:$G$459,7,FALSE)=\"S\", \"\", VLOOKUP(A14,Calendar!$A$3:$G$459,7,FALSE)),IF(VLOOKUP(A14,Calendar!$A$3:$G$459,4,FALSE)=\"S\", \"\", VLOOKUP(A14,Calendar!$A$3:$G$459,4,FALSE))))","v":"M"},{"$f":"IF(Summary!$B$5=3,IF(C14=\"\",\"\",VLOOKUP(A14,Calendar!$A$3:$G$459,5,FALSE)),IF(C14=\"\",\"\",VLOOKUP(A14,Calendar!$A$3:$G$459,2,FALSE)))","v":"2020-01-06"},null,null,null,null,0,null,null,""]
[107,null,{"$f":"IF(ISNA(IF(Summary!$B$5=3,IF(VLOOKUP(A15,Calendar!$A$3:$G$459,7,FALSE)=\"S\", \"\", VLOOKUP(A15,Calendar!$A$3:$G$459,7,FALSE)),IF(VLOOKUP(A15,Calendar!$A$3:$G$459,4,FALSE)=\"S\", \"\", VLOOKUP(A15,Calendar!$A$3:$G$459,4,FALSE)))),\"\",IF(Summary!$B$5=3,IF(VLOOKUP(A15,Calendar!$A$3:$G$459,7,FALSE)=\"S\", \"\", VLOOKUP(A15,Calendar!$A$3:$G$459,7,FALSE)),IF(VLOOKUP(A15,Calendar!$A$3:$G$459,4,FALSE)=\"S\", \"\", VLOOKUP(A15,Calendar!$A$3:$G$459,4,FALSE))))","v":"T"},{"$f":"IF(Summary!$B$5=3,IF(C15=\"\",\"\",VLOOKUP(A15,Calendar!$A$3:$G$459,5,FALSE)),IF(C15=\"\",\"\",VLOOKUP(A15,Calendar!$A$3:$G$459,2,FALSE)))","v":"2020-01-07"},null,null,null,null,0,null,null,""]
[108,null,{"$f":"IF(ISNA(IF(Summary!$B$5=3,IF(VLOOKUP(A16,Calendar!$A$3:$G$459,7,FALSE)=\"S\", \"\", VLOOKUP(A16,Calendar!$A$3:$G$459,7,FALSE)),IF(VLOOKUP(A16,Calendar!$A$3:$G$459,4,FALSE)=\"S\", \"\", VLOOKUP(A16,Calendar!$A$3:$G$459,4,FALSE)))),\"\",IF(Summary!$B$5=3,IF(VLOOKUP(A16,Calendar!$A$3:$G$459,7,FALSE)=\"S\", \"\", VLOOKUP(A16,Calendar!$A$3:$G$459,7,FALSE)),IF(VLOOKUP(A16,Calendar!$A$3:$G$459,4,FALSE)=\"S\", \"\", VLOOKUP(A16,Calendar!$A$3:$G$459,4,FALSE))))","v":"W"},{"$f":"IF(Summary!$B$5=3,IF(C16=\"\",\"\",VLOOKUP(A16,Calendar!$A$3:$G$459,5,FALSE)),IF(C16=\"\",\"\",VLOOKUP(A16,Calendar!$A$3:$G$459,2,FALSE)))","v":"2020-01-08"},null,null,null,null,0,null,null,""]
[109,null,{"$f":"IF(ISNA(IF(Summary!$B$5=3,IF(VLOOKUP(A17,Calendar!$A$3:$G$459,7,FALSE)=\"S\", \"\", VLOOKUP(A17,Calendar!$A$3:$G$459,7,FALSE)),IF(VLOOKUP(A17,Calendar!$A$3:$G$459,4,FALSE)=\"S\", \"\", VLOOKUP(A17,Calendar!$A$3:$G$459,4,FALSE)))),\"\",IF(Summary!$B$5=3,IF(VLOOKUP(A17,Calendar!$A$3:$G$459,7,FALSE)=\"S\", \"\", VLOOKUP(A17,Calendar!$A$3:$G$459,7,FALSE)),IF(VLOOKUP(A17,Calendar!$A$3:$G$459,4,FALSE)=\"S\", \"\", VLOOKUP(A17,Calendar!$A$3:$G$459,4,FALSE))))","v":"R"},{"$f":"IF(Summary!$B$5=3,IF(C17=\"\",\"\",VLOOKUP(A17,Calendar!$A$3:$G$459,5,FALSE)),IF(C17=\"\",\"\",VLOOKUP(A17,Calendar!$A$3:$G$459,2,FALSE)))","v":"2020-01-09"},null,null,null,null,0,null,null,""]
[110,null,{"$f":"IF(ISNA(IF(Summary!$B$5=3,IF(VLOOKUP(A18,Calendar!$A$3:$G$459,7,FALSE)=\"S\", \"\", VLOOKUP(A18,Calendar!$A$3:$G$459,7,FALSE)),IF(VLOOKUP(A18,Calendar!$A$3:$G$459,4,FALSE)=\"S\", \"\", VLOOKUP(A18,Calendar!$A$3:$G$459,4,FALSE)))),\"\",IF(Summary!$B$5=3,IF(VLOOKUP(A18,Calendar!$A$3:$G$459,7,FALSE)=\"S\", \"\", VLOOKUP(A18,Calendar!$A$3:$G$459,7,FALSE)),IF(VLOOKUP(A18,Calendar!$A$3:$G$459,4,FALSE)=\"S\", \"\", VLOOKUP(A18,Calendar!$A$3:$G$459,4,FALSE))))","v":"F"},{"$f":"IF(Summary!$B$5=3,IF(C18=\"\",\"\",VLOOKUP(A18,Calendar!$A$3:$G$459,5,FALSE)),IF(C18=\"\",\"\",VLOOKUP(A18,Calendar!$A$3:$G$459,2,FALSE)))","v":"2020-01-10"},null,null,null,null,0,null,null,""]
[111,null,{"$f":"IF(ISNA(IF(Summary!$B$5=3,IF(VLOOKUP(A19,Calendar!$A$3:$G$459,7,FALSE)=\"S\", \"\", VLOOKUP(A19,Calendar!$A$3:$G$459,7,FALSE)),IF(VLOOKUP(A19,Calendar!$A$3:$G$459,4,FALSE)=\"S\", \"\", VLOOKUP(A19,Calendar!$A$3:$G$459,4,FALSE)))),\"\",IF(Summary!$B$5=3,IF(VLOOKUP(A19,Calendar!$A$3:$G$459,7,FALSE)=\"S\", \"\", VLOOKUP(A19,Calendar!$A$3:$G$459,7,FALSE)),IF(VLOOKUP(A19,Calendar!$A$3:$G$459,4,FALSE)=\"S\", \"\", VLOOKUP(A19,Calendar!$A$3:$G$459,4,FALSE))))","v":""},{"$f":"IF(Summary!$B$5=3,IF(C19=\"\",\"\",VLOOKUP(A19,Calendar!$A$3:$G$459,5,FALSE)),IF(C19=\"\",\"\",VLOOKUP(A19,Calendar!$A$3:$G$459,2,FALSE)))","v":""},null,null,null,null,0,null,null,""]
[112,null,{"$f":"IF(ISNA(IF(Summary!$B$5=3,IF(VLOOKUP(A20,Calendar!$A$3:$G$459,7,FALSE)=\"S\", \"\", VLOOKUP(A20,Calendar!$A$3:$G$459,7,FALSE)),IF(VLOOKUP(A20,Calendar!$A$3:$G$459,4,FALSE)=\"S\", \"\", VLOOKUP(A20,Calendar!$A$3:$G$459,4,FALSE)))),\"\",IF(Summary!$B$5=3,IF(VLOOKUP(A20,Calendar!$A$3:$G$459,7,FALSE)=\"S\", \"\", VLOOKUP(A20,Calendar!$A$3:$G$459,7,FALSE)),IF(VLOOKUP(A20,Calendar!$A$3:$G$459,4,FALSE)=\"S\", \"\", VLOOKUP(A20,Calendar!$A$3:$G$459,4,FALSE))))","v":""},{"$f":"IF(Summary!$B$5=3,IF(C20=\"\",\"\",VLOOKUP(A20,Calendar!$A$3:$G$459,5,FALSE)),IF(C20=\"\",\"\",VLOOKUP(A20,Calendar!$A$3:$G$459,2,FALSE)))","v":""},null,null,null,null,0,null,null,""]
[113,null,{"$f":"IF(ISNA(IF(Summary!$B$5=3,IF(VLOOKUP(A21,Calendar!$A$3:$G$459,7,FALSE)=\"S\", \"\", VLOOKUP(A21,Calendar!$A$3:$G$459,7,FALSE)),IF(VLOOKUP(A21,Calendar!$A$3:$G$459,4,FALSE)=\"S\", \"\", VLOOKUP(A21,Calendar!$A$3:$G$459,4,FALSE)))),\"\",IF(Summary!$B$5=3,IF(VLOOKUP(A21,Calendar!$A$3:$G$459,7,FALSE)=\"S\", \"\", VLOOKUP(A21,Calendar!$A$3:$G$459,7,FALSE)),IF(VLOOKUP(A21,Calendar!$A$3:$G$459,4,FALSE)=\"S\", \"\", VLOOKUP(A21,Calendar!$A$3:$G$459,4,FALSE))))","v":"M"},{"$f":"IF(Summary!$B$5=3,IF(C21=\"\",\"\",VLOOKUP(A21,Calendar!$A$3:$G$459,5,FALSE)),IF(C21=\"\",\"\",VLOOKUP(A21,Calendar!$A$3:$G$459,2,FALSE)))","v":"2020-01-13"},null,null,null,null,0,null,null,""]
[114,null,{"$f":"IF(ISNA(IF(Summary!$B$5=3,IF(VLOOKUP(A22,Calendar!$A$3:$G$459,7,FALSE)=\"S\", \"\", VLOOKUP(A22,Calendar!$A$3:$G$459,7,FALSE)),IF(VLOOKUP(A22,Calendar!$A$3:$G$459,4,FALSE)=\"S\", \"\", VLOOKUP(A22,Calendar!$A$3:$G$459,4,FALSE)))),\"\",IF(Summary!$B$5=3,IF(VLOOKUP(A22,Calendar!$A$3:$G$459,7,FALSE)=\"S\", \"\", VLOOKUP(A22,Calendar!$A$3:$G$459,7,FALSE)),IF(VLOOKUP(A22,Calendar!$A$3:$G$459,4,FALSE)=\"S\", \"\", VLOOKUP(A22,Calendar!$A$3:$G$459,4,FALSE))))","v":"T"},{"$f":"IF(Summary!$B$5=3,IF(C22=\"\",\"\",VLOOKUP(A22,Calendar!$A$3:$G$459,5,FALSE)),IF(C22=\"\",\"\",VLOOKUP(A22,Calendar!$A$3:$G$459,2,FALSE)))","v":"2020-01-14"},null,null,null,null,0,null,null,""]
[115,null,{"$f":"IF(ISNA(IF(Summary!$B$5=3,IF(VLOOKUP(A23,Calendar!$A$3:$G$459,7,FALSE)=\"S\", \"\", VLOOKUP(A23,Calendar!$A$3:$G$459,7,FALSE)),IF(VLOOKUP(A23,Calendar!$A$3:$G$459,4,FALSE)=\"S\", \"\", VLOOKUP(A23,Calendar!$A$3:$G$459,4,FALSE)))),\"\",IF(Summary!$B$5=3,IF(VLOOKUP(A23,Calendar!$A$3:$G$459,7,FALSE)=\"S\", \"\", VLOOKUP(A23,Calendar!$A$3:$G$459,7,FALSE)),IF(VLOOKUP(A23,Calendar!$A$3:$G$459,4,FALSE)=\"S\", \"\", VLOOKUP(A23,Calendar!$A$3:$G$459,4,FALSE))))","v":"W"},{"$f":"IF(Summary!$B$5=3,IF(C23=\"\",\"\",VLOOKUP(A23,Calendar!$A$3:$G$459,5,FALSE)),IF(C23=\"\",\"\",VLOOKUP(A23,Calendar!$A$3:$G$459,2,FALSE)))","v":"2020-01-15"},null,null,null,null,0,null,null,""]
[116,null,{"$f":"IF(ISNA(IF(Summary!$B$5=3,IF(VLOOKUP(A24,Calendar!$A$3:$G$459,7,FALSE)=\"S\", \"\", VLOOKUP(A24,Calendar!$A$3:$G$459,7,FALSE)),IF(VLOOKUP(A24,Calendar!$A$3:$G$459,4,FALSE)=\"S\", \"\", VLOOKUP(A24,Calendar!$A$3:$G$459,4,FALSE)))),\"\",IF(Summary!$B$5=3,IF(VLOOKUP(A24,Calendar!$A$3:$G$459,7,FALSE)=\"S\", \"\", VLOOKUP(A24,Calendar!$A$3:$G$459,7,FALSE)),IF(VLOOKUP(A24,Calendar!$A$3:$G$459,4,FALSE)=\"S\", \"\", VLOOKUP(A24,Calendar!$A$3:$G$459,4,FALSE))))","v":"R"},{"$f":"IF(Summary!$B$5=3,IF(C24=\"\",\"\",VLOOKUP(A24,Calendar!$A$3:$G$459,5,FALSE)),IF(C24=\"\",\"\",VLOOKUP(A24,Calendar!$A$3:$G$459,2,FALSE)))","v":"2020-01-16"},null,null,null,null,0,null,null,""]
[117,null,{"$f":"IF(ISNA(IF(Summary!$B$5=3,IF(VLOOKUP(A25,Calendar!$A$3:$G$459,7,FALSE)=\"S\", \"\", VLOOKUP(A25,Calendar!$A$3:$G$459,7,FALSE)),IF(VLOOKUP(A25,Calendar!$A$3:$G$459,4,FALSE)=\"S\", \"\", VLOOKUP(A25,Calendar!$A$3:$G$459,4,FALSE)))),\"\",IF(Summary!$B$5=3,IF(VLOOKUP(A25,Calendar!$A$3:$G$459,7,FALSE)=\"S\", \"\", VLOOKUP(A25,Calendar!$A$3:$G$459,7,FALSE)),IF(VLOOKUP(A25,Calendar!$A$3:$G$459,4,FALSE)=\"S\", \"\", VLOOKUP(A25,Calendar!$A$3:$G$459,4,FALSE))))","v":"F"},{"$f":"IF(Summary!$B$5=3,IF(C25=\"\",\"\",VLOOKUP(A25,Calendar!$A$3:$G$459,5,FALSE)),IF(C25=\"\",\"\",VLOOKUP(A25,Calendar!$A$3:$G$459,2,FALSE)))","v":"2020-01-17"},null,null,null,null,0,null,null,""]
[118,null,{"$f":"IF(ISNA(IF(Summary!$B$5=3,IF(VLOOKUP(A26,Calendar!$A$3:$G$459,7,FALSE)=\"S\", \"\", VLOOKUP(A26,Calendar!$A$3:$G$459,7,FALSE)),IF(VLOOKUP(A26,Calendar!$A$3:$G$459,4,FALSE)=\"S\", \"\", VLOOKUP(A26,Calendar!$A$3:$G$459,4,FALSE)))),\"\",IF(Summary!$B$5=3,IF(VLOOKUP(A26,Calendar!$A$3:$G$459,7,FALSE)=\"S\", \"\", VLOOKUP(A26,Calendar!$A$3:$G$459,7,FALSE)),IF(VLOOKUP(A26,Calendar!$A$3:$G$459,4,FALSE)=\"S\", \"\", VLOOKUP(A26,Calendar!$A$3:$G$459,4,FALSE))))","v":""},{"$f":"IF(Summary!$B$5=3,IF(C26=\"\",\"\",VLOOKUP(A26,Calendar!$A$3:$G$459,5,FALSE)),IF(C26=\"\",\"\",VLOOKUP(A26,Calendar!$A$3:$G$459,2,FALSE)))","v":""},null,null,null,null,0,null,null,""]
[119,null,{"$f":"IF(ISNA(IF(Summary!$B$5=3,IF(VLOOKUP(A27,Calendar!$A$3:$G$459,7,FALSE)=\"S\", \"\", VLOOKUP(A27,Calendar!$A$3:$G$459,7,FALSE)),IF(VLOOKUP(A27,Calendar!$A$3:$G$459,4,FALSE)=\"S\", \"\", VLOOKUP(A27,Calendar!$A$3:$G$459,4,FALSE)))),\"\",IF(Summary!$B$5=3,IF(VLOOKUP(A27,Calendar!$A$3:$G$459,7,FALSE)=\"S\", \"\", VLOOKUP(A27,Calendar!$A$3:$G$459,7,FALSE)),IF(VLOOKUP(A27,Calendar!$A$3:$G$459,4,FALSE)=\"S\", \"\", VLOOKUP(A27,Calendar!$A$3:$G$459,4,FALSE))))","v":""},{"$f":"IF(Summary!$B$5=3,IF(C27=\"\",\"\",VLOOKUP(A27,Calendar!$A$3:$G$459,5,FALSE)),IF(C27=\"\",\"\",VLOOKUP(A27,Calendar!$A$3:$G$459,2,FALSE)))","v":""},null,null,null,null,0,null,null,""]
[120,null,{"$f":"IF(ISNA(IF(Summary!$B$5=3,IF(VLOOKUP(A28,Calendar!$A$3:$G$459,7,FALSE)=\"S\", \"\", VLOOKUP(A28,Calendar!$A$3:$G$459,7,FALSE)),IF(VLOOKUP(A28,Calendar!$A$3:$G$459,4,FALSE)=\"S\", \"\", VLOOKUP(A28,Calendar!$A$3:$G$459,4,FALSE)))),\"\",IF(Summary!$B$5=3,IF(VLOOKUP(A28,Calendar!$A$3:$G$459,7,FALSE)=\"S\", \"\", VLOOKUP(A28,Calendar!$A$3:$G$459,7,FALSE)),IF(VLOOKUP(A28,Calendar!$A$3:$G$459,4,FALSE)=\"S\", \"\", VLOOKUP(A28,Calendar!$A$3:$G$459,4,FALSE))))","v":"M"},{"$f":"IF(Summary!$B$5=3,IF(C28=\"\",\"\",VLOOKUP(A28,Calendar!$A$3:$G$459,5,FALSE)),IF(C28=\"\",\"\",VLOOKUP(A28,Calendar!$A$3:$G$459,2,FALSE)))","v":"2020-01-20"},null,null,null,null,0,null,null,""]
[121,null,{"$f":"IF(ISNA(IF(Summary!$B$5=3,IF(VLOOKUP(A29,Calendar!$A$3:$G$459,7,FALSE)=\"S\", \"\", VLOOKUP(A29,Calendar!$A$3:$G$459,7,FALSE)),IF(VLOOKUP(A29,Calendar!$A$3:$G$459,4,FALSE)=\"S\", \"\", VLOOKUP(A29,Calendar!$A$3:$G$459,4,FALSE)))),\"\",IF(Summary!$B$5=3,IF(VLOOKUP(A29,Calendar!$A$3:$G$459,7,FALSE)=\"S\", \"\", VLOOKUP(A29,Calendar!$A$3:$G$459,7,FALSE)),IF(VLOOKUP(A29,Calendar!$A$3:$G$459,4,FALSE)=\"S\", \"\", VLOOKUP(A29,Calendar!$A$3:$G$459,4,FALSE))))","v":"T"},{"$f":"IF(Summary!$B$5=3,IF(C29=\"\",\"\",VLOOKUP(A29,Calendar!$A$3:$G$459,5,FALSE)),IF(C29=\"\",\"\",VLOOKUP(A29,Calendar!$A$3:$G$459,2,FALSE)))","v":"2020-01-21"},null,null,null,null,0,null,null,""]
[122,null,{"$f":"IF(ISNA(IF(Summary!$B$5=3,IF(VLOOKUP(A30,Calendar!$A$3:$G$459,7,FALSE)=\"S\", \"\", VLOOKUP(A30,Calendar!$A$3:$G$459,7,FALSE)),IF(VLOOKUP(A30,Calendar!$A$3:$G$459,4,FALSE)=\"S\", \"\", VLOOKUP(A30,Calendar!$A$3:$G$459,4,FALSE)))),\"\",IF(Summary!$B$5=3,IF(VLOOKUP(A30,Calendar!$A$3:$G$459,7,FALSE)=\"S\", \"\", VLOOKUP(A30,Calendar!$A$3:$G$459,7,FALSE)),IF(VLOOKUP(A30,Calendar!$A$3:$G$459,4,FALSE)=\"S\", \"\", VLOOKUP(A30,Calendar!$A$3:$G$459,4,FALSE))))","v":"W"},{"$f":"IF(Summary!$B$5=3,IF(C30=\"\",\"\",VLOOKUP(A30,Calendar!$A$3:$G$459,5,FALSE)),IF(C30=\"\",\"\",VLOOKUP(A30,Calendar!$A$3:$G$459,2,FALSE)))","v":"2020-01-22"},null,null,null,null,0,null,null,""]
[123,null,{"$f":"IF(ISNA(IF(Summary!$B$5=3,IF(VLOOKUP(A31,Calendar!$A$3:$G$459,7,FALSE)=\"S\", \"\", VLOOKUP(A31,Calendar!$A$3:$G$459,7,FALSE)),IF(VLOOKUP(A31,Calendar!$A$3:$G$459,4,FALSE)=\"S\", \"\", VLOOKUP(A31,Calendar!$A$3:$G$459,4,FALSE)))),\"\",IF(Summary!$B$5=3,IF(VLOOKUP(A31,Calendar!$A$3:$G$459,7,FALSE)=\"S\", \"\", VLOOKUP(A31,Calendar!$A$3:$G$459,7,FALSE)),IF(VLOOKUP(A31,Calendar!$A$3:$G$459,4,FALSE)=\"S\", \"\", VLOOKUP(A31,Calendar!$A$3:$G$459,4,FALSE))))","v":"R"},{"$f":"IF(Summary!$B$5=3,IF(C31=\"\",\"\",VLOOKUP(A31,Calendar!$A$3:$G$459,5,FALSE)),IF(C31=\"\",\"\",VLOOKUP(A31,Calendar!$A$3:$G$459,2,FALSE)))","v":"2020-01-23"},null,null,null,null,0,null,null,""]
[124,null,{"$f":"IF(ISNA(IF(Summary!$B$5=3,IF(VLOOKUP(A32,Calendar!$A$3:$G$459,7,FALSE)=\"S\", \"\", VLOOKUP(A32,Calendar!$A$3:$G$459,7,FALSE)),IF(VLOOKUP(A32,Calendar!$A$3:$G$459,4,FALSE)=\"S\", \"\", VLOOKUP(A32,Calendar!$A$3:$G$459,4,FALSE)))),\"\",IF(Summary!$B$5=3,IF(VLOOKUP(A32,Calendar!$A$3:$G$459,7,FALSE)=\"S\", \"\", VLOOKUP(A32,Calendar!$A$3:$G$459,7,FALSE)),IF(VLOOKUP(A32,Calendar!$A$3:$G$459,4,FALSE)=\"S\", \"\", VLOOKUP(A32,Calendar!$A$3:$G$459,4,FALSE))))","v":"F"},{"$f":"IF(Summary!$B$5=3,IF(C32=\"\",\"\",VLOOKUP(A32,Calendar!$A$3:$G$459,5,FALSE)),IF(C32=\"\",\"\",VLOOKUP(A32,Calendar!$A$3:$G$459,2,FALSE)))","v":"2020-01-24"},null,null,null,null,0,null,null,""]
[125,null,{"$f":"IF(ISNA(IF(Summary!$B$5=3,IF(VLOOKUP(A33,Calendar!$A$3:$G$459,7,FALSE)=\"S\", \"\", VLOOKUP(A33,Calendar!$A$3:$G$459,7,FALSE)),IF(VLOOKUP(A33,Calendar!$A$3:$G$459,4,FALSE)=\"S\", \"\", VLOOKUP(A33,Calendar!$A$3:$G$459,4,FALSE)))),\"\",IF(Summary!$B$5=3,IF(VLOOKUP(A33,Calendar!$A$3:$G$459,7,FALSE)=\"S\", \"\", VLOOKUP(A33,Calendar!$A$3:$G$459,7,FALSE)),IF(VLOOKUP(A33,Calendar!$A$3:$G$459,4,FALSE)=\"S\", \"\", VLOOKUP(A33,Calendar!$A$3:$G$459,4,FALSE))))","v":""},{"$f":"IF(Summary!$B$5=3,IF(C33=\"\",\"\",VLOOKUP(A33,Calendar!$A$3:$G$459,5,FALSE)),IF(C33=\"\",\"\",VLOOKUP(A33,Calendar!$A$3:$G$459,2,FALSE)))","v":""},null,null,null,null,0,null,null,""]
[126,null,{"$f":"IF(ISNA(IF(Summary!$B$5=3,IF(VLOOKUP(A34,Calendar!$A$3:$G$459,7,FALSE)=\"S\", \"\", VLOOKUP(A34,Calendar!$A$3:$G$459,7,FALSE)),IF(VLOOKUP(A34,Calendar!$A$3:$G$459,4,FALSE)=\"S\", \"\", VLOOKUP(A34,Calendar!$A$3:$G$459,4,FALSE)))),\"\",IF(Summary!$B$5=3,IF(VLOOKUP(A34,Calendar!$A$3:$G$459,7,FALSE)=\"S\", \"\", VLOOKUP(A34,Calendar!$A$3:$G$459,7,FALSE)),IF(VLOOKUP(A34,Calendar!$A$3:$G$459,4,FALSE)=\"S\", \"\", VLOOKUP(A34,Calendar!$A$3:$G$459,4,FALSE))))","v":""},{"$f":"IF(Summary!$B$5=3,IF(C34=\"\",\"\",VLOOKUP(A34,Calendar!$A$3:$G$459,5,FALSE)),IF(C34=\"\",\"\",VLOOKUP(A34,Calendar!$A$3:$G$459,2,FALSE)))","v":""},null,null,null,null,0,null,null,""]
[127,null,{"$f":"IF(ISNA(IF(Summary!$B$5=3,IF(VLOOKUP(A35,Calendar!$A$3:$G$459,7,FALSE)=\"S\", \"\", VLOOKUP(A35,Calendar!$A$3:$G$459,7,FALSE)),IF(VLOOKUP(A35,Calendar!$A$3:$G$459,4,FALSE)=\"S\", \"\", VLOOKUP(A35,Calendar!$A$3:$G$459,4,FALSE)))),\"\",IF(Summary!$B$5=3,IF(VLOOKUP(A35,Calendar!$A$3:$G$459,7,FALSE)=\"S\", \"\", VLOOKUP(A35,Calendar!$A$3:$G$459,7,FALSE)),IF(VLOOKUP(A35,Calendar!$A$3:$G$459,4,FALSE)=\"S\", \"\", VLOOKUP(A35,Calendar!$A$3:$G$459,4,FALSE))))","v":"M"},{"$f":"IF(Summary!$B$5=3,IF(C35=\"\",\"\",VLOOKUP(A35,Calendar!$A$3:$G$459,5,FALSE)),IF(C35=\"\",\"\",VLOOKUP(A35,Calendar!$A$3:$G$459,2,FALSE)))","v":"2020-01-27"},null,null,null,null,0,null,null,""]
[128,null,{"$f":"IF(ISNA(IF(Summary!$B$5=3,IF(VLOOKUP(A36,Calendar!$A$3:$G$459,7,FALSE)=\"S\", \"\", VLOOKUP(A36,Calendar!$A$3:$G$459,7,FALSE)),IF(VLOOKUP(A36,Calendar!$A$3:$G$459,4,FALSE)=\"S\", \"\", VLOOKUP(A36,Calendar!$A$3:$G$459,4,FALSE)))),\"\",IF(Summary!$B$5=3,IF(VLOOKUP(A36,Calendar!$A$3:$G$459,7,FALSE)=\"S\", \"\", VLOOKUP(A36,Calendar!$A$3:$G$459,7,FALSE)),IF(VLOOKUP(A36,Calendar!$A$3:$G$459,4,FALSE)=\"S\", \"\", VLOOKUP(A36,Calendar!$A$3:$G$459,4,FALSE))))","v":"T"},{"$f":"IF(Summary!$B$5=3,IF(C36=\"\",\"\",VLOOKUP(A36,Calendar!$A$3:$G$459,5,FALSE)),IF(C36=\"\",\"\",VLOOKUP(A36,Calendar!$A$3:$G$459,2,FALSE)))","v":"2020-01-28"},null,null,null,null,0,null,null,""]
[129,null,{"$f":"IF(ISNA(IF(Summary!$B$5=3,IF(VLOOKUP(A37,Calendar!$A$3:$G$459,7,FALSE)=\"S\", \"\", VLOOKUP(A37,Calendar!$A$3:$G$459,7,FALSE)),IF(VLOOKUP(A37,Calendar!$A$3:$G$459,4,FALSE)=\"S\", \"\", VLOOKUP(A37,Calendar!$A$3:$G$459,4,FALSE)))),\"\",IF(Summary!$B$5=3,IF(VLOOKUP(A37,Calendar!$A$3:$G$459,7,FALSE)=\"S\", \"\", VLOOKUP(A37,Calendar!$A$3:$G$459,7,FALSE)),IF(VLOOKUP(A37,Calendar!$A$3:$G$459,4,FALSE)=\"S\", \"\", VLOOKUP(A37,Calendar!$A$3:$G$459,4,FALSE))))","v":"W"},{"$f":"IF(Summary!$B$5=3,IF(C37=\"\",\"\",VLOOKUP(A37,Calendar!$A$3:$G$459,5,FALSE)),IF(C37=\"\",\"\",VLOOKUP(A37,Calendar!$A$3:$G$459,2,FALSE)))","v":"2020-01-29"},null,null,null,null,0,null,null,""]
[130,null,{"$f":"IF(ISNA(IF(Summary!$B$5=3,IF(VLOOKUP(A38,Calendar!$A$3:$G$459,7,FALSE)=\"S\", \"\", VLOOKUP(A38,Calendar!$A$3:$G$459,7,FALSE)),IF(VLOOKUP(A38,Calendar!$A$3:$G$459,4,FALSE)=\"S\", \"\", VLOOKUP(A38,Calendar!$A$3:$G$459,4,FALSE)))),\"\",IF(Summary!$B$5=3,IF(VLOOKUP(A38,Calendar!$A$3:$G$459,7,FALSE)=\"S\", \"\", VLOOKUP(A38,Calendar!$A$3:$G$459,7,FALSE)),IF(VLOOKUP(A38,Calendar!$A$3:$G$459,4,FALSE)=\"S\", \"\", VLOOKUP(A38,Calendar!$A$3:$G$459,4,FALSE))))","v":"R"},{"$f":"IF(Summary!$B$5=3,IF(C38=\"\",\"\",VLOOKUP(A38,Calendar!$A$3:$G$459,5,FALSE)),IF(C38=\"\",\"\",VLOOKUP(A38,Calendar!$A$3:$G$459,2,FALSE)))","v":"2020-01-30"},null,null,null,null,0,null,null,""]
[131,null,{"$f":"IF(ISNA(IF(Summary!$B$5=3,IF(VLOOKUP(A39,Calendar!$A$3:$G$459,7,FALSE)=\"S\", \"\", VLOOKUP(A39,Calendar!$A$3:$G$459,7,FALSE)),IF(VLOOKUP(A39,Calendar!$A$3:$G$459,4,FALSE)=\"S\", \"\", VLOOKUP(A39,Calendar!$A$3:$G$459,4,FALSE)))),\"\",IF(Summary!$B$5=3,IF(VLOOKUP(A39,Calendar!$A$3:$G$459,7,FALSE)=\"S\", \"\", VLOOKUP(A39,Calendar!$A$3:$G$459,7,FALSE)),IF(VLOOKUP(A39,Calendar!$A$3:$G$459,4,FALSE)=\"S\", \"\", VLOOKUP(A39,Calendar!$A$3:$G$459,4,FALSE))))","v":"F"},{"$f":"IF(Summary!$B$5=3,IF(C39=\"\",\"\",VLOOKUP(A39,Calendar!$A$3:$G$459,5,FALSE)),IF(C39=\"\",\"\",VLOOKUP(A39,Calendar!$A$3:$G$459,2,FALSE)))","v":"2020-01-31"},null,null,null,null,0,null,null,""]
[null,null,null,"Total Minutes",{"$f":"SUM(E9:E39)","v":0},{"$f":"SUM(F9:F39)","v":0},0,0,0,null,null,{"$f":"IF(SUM(E40:H40)>COUNTA(E9:E39)*390,\"The sum total for all cost objectives exceeds the maximum anticipated value based upon the number of days worked. Confirm minutes claimed for each day.\",\"\")","v":""}]
[null,null,null,"Total Hours",{"$f":"E40/60","v":0},{"$f":"F40/60","v":0},0,0,0]
[]
[]
[null,null,"Notes"]
[]
[]
[]
[]
[]
[]
[]
[]
[]
[]
[null,null,null,null,"Kansas State Department of Education",null,null,null,"Personnel Activity Report"]
[null,null,null,null,"Fiscal Auditing",null,null,null,"Updated 9/20/18"]
[null,null,null,null,"785-296-4976"]
[null,null,null,null,"https://www.ksde.org/Agency/Fiscal-and-Administrative-Services/Fiscal-Auditing"]
[]
[]
[null,null,"The Kansas State Department of Education does not discriminate on the basis of race, color, national origin, sex, disability, or age in its programs and activities and provides equal access to the Boy Scouts and other designated youth groups. The following person has been designated to handle inquiries regarding the nondiscrimination policies: KSDE General Counsel, Office of General Counsel, KSDE, Landon State Office Building, 900 S.W. Jackson, Suite 102, Topeka, KS 66612, (785) 296-3204."]

{"sheet":"February","index":9,"n_rows":62,"n_cols":12,"rows_kept":62,"cut":false,"hidden":false,"merged":[[61,2,62,8],[1,2,1,8],[2,2,2,8],[3,2,3,8],[4,2,4,8],[46,2,46,8],[47,2,47,8],[48,2,48,8],[49,2,49,8],[5,2,5,8],[6,2,6,8],[43,3,43,8],[44,2,44,8],[45,2,45,8]]}
[]
[]
[null,null,"Personnel Activity Report"]
[null,null,"Regular School Year"]
[null,null,"February"]
[null,null,{"$f":"IF(Summary!$E$8<>\"\",Summary!$E$8,\" \")","v":" "}]
[null,null,{"$f":"IF(Summary!$E$9<>\"\",Summary!$E$9,\" \")","v":" "}]
[null,null,"Day","Date","Special Ed","General Ed","Other","Other","Totals",null,null,{"$f":"IF(OR(AND(F8=\"\",COUNTA(F9:F39)>0),AND(G8=\"\",COUNTA(G9:G39)>0),AND(H8=\"\",COUNTA(H9:H39)>0)),\"<<< You must identify the cost objective in the column heading.\",\"\")","v":""}]
[201,null,{"$f":"IF(ISNA(IF(Summary!$B$5=3,IF(VLOOKUP(A9,Calendar!$A$3:$G$459,7,FALSE)=\"S\", \"\", VLOOKUP(A9,Calendar!$A$3:$G$459,7,FALSE)),IF(VLOOKUP(A9,Calendar!$A$3:$G$459,4,FALSE)=\"S\", \"\", VLOOKUP(A9,Calendar!$A$3:$G$459,4,FALSE)))),\"\",IF(Summary!$B$5=3,IF(VLOOKUP(A9,Calendar!$A$3:$G$459,7,FALSE)=\"S\", \"\", VLOOKUP(A9,Calendar!$A$3:$G$459,7,FALSE)),IF(VLOOKUP(A9,Calendar!$A$3:$G$459,4,FALSE)=\"S\", \"\", VLOOKUP(A9,Calendar!$A$3:$G$459,4,FALSE))))","v":""},{"$f":"IF(Summary!$B$5=3,IF(C9=\"\",\"\",VLOOKUP(A9,Calendar!$A$3:$G$459,5,FALSE)),IF(C9=\"\",\"\",VLOOKUP(A9,Calendar!$A$3:$G$459,2,FALSE)))","v":""},null,null,null,null,{"$f":"MIN(1440,SUM(E9:H9))","v":0},null,null,{"$f":"IF(I9>390, \"<<< Day exceeds 390 minutes. Confirm reported time.\",\"\")","v":""}]
[202,null,{"$f":"IF(ISNA(IF(Summary!$B$5=3,IF(VLOOKUP(A10,Calendar!$A$3:$G$459,7,FALSE)=\"S\", \"\", VLOOKUP(A10,Calendar!$A$3:$G$459,7,FALSE)),IF(VLOOKUP(A10,Calendar!$A$3:$G$459,4,FALSE)=\"S\", \"\", VLOOKUP(A10,Calendar!$A$3:$G$459,4,FALSE)))),\"\",IF(Summary!$B$5=3,IF(VLOOKUP(A10,Calendar!$A$3:$G$459,7,FALSE)=\"S\", \"\", VLOOKUP(A10,Calendar!$A$3:$G$459,7,FALSE)),IF(VLOOKUP(A10,Calendar!$A$3:$G$459,4,FALSE)=\"S\", \"\", VLOOKUP(A10,Calendar!$A$3:$G$459,4,FALSE))))","v":""},{"$f":"IF(Summary!$B$5=3,IF(C10=\"\",\"\",VLOOKUP(A10,Calendar!$A$3:$G$459,5,FALSE)),IF(C10=\"\",\"\",VLOOKUP(A10,Calendar!$A$3:$G$459,2,FALSE)))","v":""},null,null,null,null,{"$f":"MIN(1440,SUM(E10:H10))","v":0},null,null,{"$f":"IF(I10>390, \"<<< Day exceeds 390 minutes. Confirm reported time.\",\"\")","v":""}]
[203,null,{"$f":"IF(ISNA(IF(Summary!$B$5=3,IF(VLOOKUP(A11,Calendar!$A$3:$G$459,7,FALSE)=\"S\", \"\", VLOOKUP(A11,Calendar!$A$3:$G$459,7,FALSE)),IF(VLOOKUP(A11,Calendar!$A$3:$G$459,4,FALSE)=\"S\", \"\", VLOOKUP(A11,Calendar!$A$3:$G$459,4,FALSE)))),\"\",IF(Summary!$B$5=3,IF(VLOOKUP(A11,Calendar!$A$3:$G$459,7,FALSE)=\"S\", \"\", VLOOKUP(A11,Calendar!$A$3:$G$459,7,FALSE)),IF(VLOOKUP(A11,Calendar!$A$3:$G$459,4,FALSE)=\"S\", \"\", VLOOKUP(A11,Calendar!$A$3:$G$459,4,FALSE))))","v":"M"},{"$f":"IF(Summary!$B$5=3,IF(C11=\"\",\"\",VLOOKUP(A11,Calendar!$A$3:$G$459,5,FALSE)),IF(C11=\"\",\"\",VLOOKUP(A11,Calendar!$A$3:$G$459,2,FALSE)))","v":"2020-02-03"},null,null,null,null,0,null,null,""]
[204,null,{"$f":"IF(ISNA(IF(Summary!$B$5=3,IF(VLOOKUP(A12,Calendar!$A$3:$G$459,7,FALSE)=\"S\", \"\", VLOOKUP(A12,Calendar!$A$3:$G$459,7,FALSE)),IF(VLOOKUP(A12,Calendar!$A$3:$G$459,4,FALSE)=\"S\", \"\", VLOOKUP(A12,Calendar!$A$3:$G$459,4,FALSE)))),\"\",IF(Summary!$B$5=3,IF(VLOOKUP(A12,Calendar!$A$3:$G$459,7,FALSE)=\"S\", \"\", VLOOKUP(A12,Calendar!$A$3:$G$459,7,FALSE)),IF(VLOOKUP(A12,Calendar!$A$3:$G$459,4,FALSE)=\"S\", \"\", VLOOKUP(A12,Calendar!$A$3:$G$459,4,FALSE))))","v":"T"},{"$f":"IF(Summary!$B$5=3,IF(C12=\"\",\"\",VLOOKUP(A12,Calendar!$A$3:$G$459,5,FALSE)),IF(C12=\"\",\"\",VLOOKUP(A12,Calendar!$A$3:$G$459,2,FALSE)))","v":"2020-02-04"},null,null,null,null,0,null,null,""]
[205,null,{"$f":"IF(ISNA(IF(Summary!$B$5=3,IF(VLOOKUP(A13,Calendar!$A$3:$G$459,7,FALSE)=\"S\", \"\", VLOOKUP(A13,Calendar!$A$3:$G$459,7,FALSE)),IF(VLOOKUP(A13,Calendar!$A$3:$G$459,4,FALSE)=\"S\", \"\", VLOOKUP(A13,Calendar!$A$3:$G$459,4,FALSE)))),\"\",IF(Summary!$B$5=3,IF(VLOOKUP(A13,Calendar!$A$3:$G$459,7,FALSE)=\"S\", \"\", VLOOKUP(A13,Calendar!$A$3:$G$459,7,FALSE)),IF(VLOOKUP(A13,Calendar!$A$3:$G$459,4,FALSE)=\"S\", \"\", VLOOKUP(A13,Calendar!$A$3:$G$459,4,FALSE))))","v":"W"},{"$f":"IF(Summary!$B$5=3,IF(C13=\"\",\"\",VLOOKUP(A13,Calendar!$A$3:$G$459,5,FALSE)),IF(C13=\"\",\"\",VLOOKUP(A13,Calendar!$A$3:$G$459,2,FALSE)))","v":"2020-02-05"},null,null,null,null,0,null,null,""]
[206,null,{"$f":"IF(ISNA(IF(Summary!$B$5=3,IF(VLOOKUP(A14,Calendar!$A$3:$G$459,7,FALSE)=\"S\", \"\", VLOOKUP(A14,Calendar!$A$3:$G$459,7,FALSE)),IF(VLOOKUP(A14,Calendar!$A$3:$G$459,4,FALSE)=\"S\", \"\", VLOOKUP(A14,Calendar!$A$3:$G$459,4,FALSE)))),\"\",IF(Summary!$B$5=3,IF(VLOOKUP(A14,Calendar!$A$3:$G$459,7,FALSE)=\"S\", \"\", VLOOKUP(A14,Calendar!$A$3:$G$459,7,FALSE)),IF(VLOOKUP(A14,Calendar!$A$3:$G$459,4,FALSE)=\"S\", \"\", VLOOKUP(A14,Calendar!$A$3:$G$459,4,FALSE))))","v":"R"},{"$f":"IF(Summary!$B$5=3,IF(C14=\"\",\"\",VLOOKUP(A14,Calendar!$A$3:$G$459,5,FALSE)),IF(C14=\"\",\"\",VLOOKUP(A14,Calendar!$A$3:$G$459,2,FALSE)))","v":"2020-02-06"},null,null,null,null,0,null,null,""]
[207,null,{"$f":"IF(ISNA(IF(Summary!$B$5=3,IF(VLOOKUP(A15,Calendar!$A$3:$G$459,7,FALSE)=\"S\", \"\", VLOOKUP(A15,Calendar!$A$3:$G$459,7,FALSE)),IF(VLOOKUP(A15,Calendar!$A$3:$G$459,4,FALSE)=\"S\", \"\", VLOOKUP(A15,Calendar!$A$3:$G$459,4,FALSE)))),\"\",IF(Summary!$B$5=3,IF(VLOOKUP(A15,Calendar!$A$3:$G$459,7,FALSE)=\"S\", \"\", VLOOKUP(A15,Calendar!$A$3:$G$459,7,FALSE)),IF(VLOOKUP(A15,Calendar!$A$3:$G$459,4,FALSE)=\"S\", \"\", VLOOKUP(A15,Calendar!$A$3:$G$459,4,FALSE))))","v":"F"},{"$f":"IF(Summary!$B$5=3,IF(C15=\"\",\"\",VLOOKUP(A15,Calendar!$A$3:$G$459,5,FALSE)),IF(C15=\"\",\"\",VLOOKUP(A15,Calendar!$A$3:$G$459,2,FALSE)))","v":"2020-02-07"},null,null,null,null,0,null,null,""]
[208,null,{"$f":"IF(ISNA(IF(Summary!$B$5=3,IF(VLOOKUP(A16,Calendar!$A$3:$G$459,7,FALSE)=\"S\", \"\", VLOOKUP(A16,Calendar!$A$3:$G$459,7,FALSE)),IF(VLOOKUP(A16,Calendar!$A$3:$G$459,4,FALSE)=\"S\", \"\", VLOOKUP(A16,Calendar!$A$3:$G$459,4,FALSE)))),\"\",IF(Summary!$B$5=3,IF(VLOOKUP(A16,Calendar!$A$3:$G$459,7,FALSE)=\"S\", \"\", VLOOKUP(A16,Calendar!$A$3:$G$459,7,FALSE)),IF(VLOOKUP(A16,Calendar!$A$3:$G$459,4,FALSE)=\"S\", \"\", VLOOKUP(A16,Calendar!$A$3:$G$459,4,FALSE))))","v":""},{"$f":"IF(Summary!$B$5=3,IF(C16=\"\",\"\",VLOOKUP(A16,Calendar!$A$3:$G$459,5,FALSE)),IF(C16=\"\",\"\",VLOOKUP(A16,Calendar!$A$3:$G$459,2,FALSE)))","v":""},null,null,null,null,0,null,null,""]
[209,null,{"$f":"IF(ISNA(IF(Summary!$B$5=3,IF(VLOOKUP(A17,Calendar!$A$3:$G$459,7,FALSE)=\"S\", \"\", VLOOKUP(A17,Calendar!$A$3:$G$459,7,FALSE)),IF(VLOOKUP(A17,Calendar!$A$3:$G$459,4,FALSE)=\"S\", \"\", VLOOKUP(A17,Calendar!$A$3:$G$459,4,FALSE)))),\"\",IF(Summary!$B$5=3,IF(VLOOKUP(A17,Calendar!$A$3:$G$459,7,FALSE)=\"S\", \"\", VLOOKUP(A17,Calendar!$A$3:$G$459,7,FALSE)),IF(VLOOKUP(A17,Calendar!$A$3:$G$459,4,FALSE)=\"S\", \"\", VLOOKUP(A17,Calendar!$A$3:$G$459,4,FALSE))))","v":""},{"$f":"IF(Summary!$B$5=3,IF(C17=\"\",\"\",VLOOKUP(A17,Calendar!$A$3:$G$459,5,FALSE)),IF(C17=\"\",\"\",VLOOKUP(A17,Calendar!$A$3:$G$459,2,FALSE)))","v":""},null,null,null,null,0,null,null,""]
[210,null,{"$f":"IF(ISNA(IF(Summary!$B$5=3,IF(VLOOKUP(A18,Calendar!$A$3:$G$459,7,FALSE)=\"S\", \"\", VLOOKUP(A18,Calendar!$A$3:$G$459,7,FALSE)),IF(VLOOKUP(A18,Calendar!$A$3:$G$459,4,FALSE)=\"S\", \"\", VLOOKUP(A18,Calendar!$A$3:$G$459,4,FALSE)))),\"\",IF(Summary!$B$5=3,IF(VLOOKUP(A18,Calendar!$A$3:$G$459,7,FALSE)=\"S\", \"\", VLOOKUP(A18,Calendar!$A$3:$G$459,7,FALSE)),IF(VLOOKUP(A18,Calendar!$A$3:$G$459,4,FALSE)=\"S\", \"\", VLOOKUP(A18,Calendar!$A$3:$G$459,4,FALSE))))","v":"M"},{"$f":"IF(Summary!$B$5=3,IF(C18=\"\",\"\",VLOOKUP(A18,Calendar!$A$3:$G$459,5,FALSE)),IF(C18=\"\",\"\",VLOOKUP(A18,Calendar!$A$3:$G$459,2,FALSE)))","v":"2020-02-10"},null,null,null,null,0,null,null,""]
[211,null,{"$f":"IF(ISNA(IF(Summary!$B$5=3,IF(VLOOKUP(A19,Calendar!$A$3:$G$459,7,FALSE)=\"S\", \"\", VLOOKUP(A19,Calendar!$A$3:$G$459,7,FALSE)),IF(VLOOKUP(A19,Calendar!$A$3:$G$459,4,FALSE)=\"S\", \"\", VLOOKUP(A19,Calendar!$A$3:$G$459,4,FALSE)))),\"\",IF(Summary!$B$5=3,IF(VLOOKUP(A19,Calendar!$A$3:$G$459,7,FALSE)=\"S\", \"\", VLOOKUP(A19,Calendar!$A$3:$G$459,7,FALSE)),IF(VLOOKUP(A19,Calendar!$A$3:$G$459,4,FALSE)=\"S\", \"\", VLOOKUP(A19,Calendar!$A$3:$G$459,4,FALSE))))","v":"T"},{"$f":"IF(Summary!$B$5=3,IF(C19=\"\",\"\",VLOOKUP(A19,Calendar!$A$3:$G$459,5,FALSE)),IF(C19=\"\",\"\",VLOOKUP(A19,Calendar!$A$3:$G$459,2,FALSE)))","v":"2020-02-11"},null,null,null,null,0,null,null,""]
[212,null,{"$f":"IF(ISNA(IF(Summary!$B$5=3,IF(VLOOKUP(A20,Calendar!$A$3:$G$459,7,FALSE)=\"S\", \"\", VLOOKUP(A20,Calendar!$A$3:$G$459,7,FALSE)),IF(VLOOKUP(A20,Calendar!$A$3:$G$459,4,FALSE)=\"S\", \"\", VLOOKUP(A20,Calendar!$A$3:$G$459,4,FALSE)))),\"\",IF(Summary!$B$5=3,IF(VLOOKUP(A20,Calendar!$A$3:$G$459,7,FALSE)=\"S\", \"\", VLOOKUP(A20,Calendar!$A$3:$G$459,7,FALSE)),IF(VLOOKUP(A20,Calendar!$A$3:$G$459,4,FALSE)=\"S\", \"\", VLOOKUP(A20,Calendar!$A$3:$G$459,4,FALSE))))","v":"W"},{"$f":"IF(Summary!$B$5=3,IF(C20=\"\",\"\",VLOOKUP(A20,Calendar!$A$3:$G$459,5,FALSE)),IF(C20=\"\",\"\",VLOOKUP(A20,Calendar!$A$3:$G$459,2,FALSE)))","v":"2020-02-12"},null,null,null,null,0,null,null,""]
[213,null,{"$f":"IF(ISNA(IF(Summary!$B$5=3,IF(VLOOKUP(A21,Calendar!$A$3:$G$459,7,FALSE)=\"S\", \"\", VLOOKUP(A21,Calendar!$A$3:$G$459,7,FALSE)),IF(VLOOKUP(A21,Calendar!$A$3:$G$459,4,FALSE)=\"S\", \"\", VLOOKUP(A21,Calendar!$A$3:$G$459,4,FALSE)))),\"\",IF(Summary!$B$5=3,IF(VLOOKUP(A21,Calendar!$A$3:$G$459,7,FALSE)=\"S\", \"\", VLOOKUP(A21,Calendar!$A$3:$G$459,7,FALSE)),IF(VLOOKUP(A21,Calendar!$A$3:$G$459,4,FALSE)=\"S\", \"\", VLOOKUP(A21,Calendar!$A$3:$G$459,4,FALSE))))","v":"R"},{"$f":"IF(Summary!$B$5=3,IF(C21=\"\",\"\",VLOOKUP(A21,Calendar!$A$3:$G$459,5,FALSE)),IF(C21=\"\",\"\",VLOOKUP(A21,Calendar!$A$3:$G$459,2,FALSE)))","v":"2020-02-13"},null,null,null,null,0,null,null,""]
[214,null,{"$f":"IF(ISNA(IF(Summary!$B$5=3,IF(VLOOKUP(A22,Calendar!$A$3:$G$459,7,FALSE)=\"S\", \"\", VLOOKUP(A22,Calendar!$A$3:$G$459,7,FALSE)),IF(VLOOKUP(A22,Calendar!$A$3:$G$459,4,FALSE)=\"S\", \"\", VLOOKUP(A22,Calendar!$A$3:$G$459,4,FALSE)))),\"\",IF(Summary!$B$5=3,IF(VLOOKUP(A22,Calendar!$A$3:$G$459,7,FALSE)=\"S\", \"\", VLOOKUP(A22,Calendar!$A$3:$G$459,7,FALSE)),IF(VLOOKUP(A22,Calendar!$A$3:$G$459,4,FALSE)=\"S\", \"\", VLOOKUP(A22,Calendar!$A$3:$G$459,4,FALSE))))","v":"F"},{"$f":"IF(Summary!$B$5=3,IF(C22=\"\",\"\",VLOOKUP(A22,Calendar!$A$3:$G$459,5,FALSE)),IF(C22=\"\",\"\",VLOOKUP(A22,Calendar!$A$3:$G$459,2,FALSE)))","v":"2020-02-14"},null,null,null,null,0,null,null,""]
[215,null,{"$f":"IF(ISNA(IF(Summary!$B$5=3,IF(VLOOKUP(A23,Calendar!$A$3:$G$459,7,FALSE)=\"S\", \"\", VLOOKUP(A23,Calendar!$A$3:$G$459,7,FALSE)),IF(VLOOKUP(A23,Calendar!$A$3:$G$459,4,FALSE)=\"S\", \"\", VLOOKUP(A23,Calendar!$A$3:$G$459,4,FALSE)))),\"\",IF(Summary!$B$5=3,IF(VLOOKUP(A23,Calendar!$A$3:$G$459,7,FALSE)=\"S\", \"\", VLOOKUP(A23,Calendar!$A$3:$G$459,7,FALSE)),IF(VLOOKUP(A23,Calendar!$A$3:$G$459,4,FALSE)=\"S\", \"\", VLOOKUP(A23,Calendar!$A$3:$G$459,4,FALSE))))","v":""},{"$f":"IF(Summary!$B$5=3,IF(C23=\"\",\"\",VLOOKUP(A23,Calendar!$A$3:$G$459,5,FALSE)),IF(C23=\"\",\"\",VLOOKUP(A23,Calendar!$A$3:$G$459,2,FALSE)))","v":""},null,null,null,null,0,null,null,""]
[216,null,{"$f":"IF(ISNA(IF(Summary!$B$5=3,IF(VLOOKUP(A24,Calendar!$A$3:$G$459,7,FALSE)=\"S\", \"\", VLOOKUP(A24,Calendar!$A$3:$G$459,7,FALSE)),IF(VLOOKUP(A24,Calendar!$A$3:$G$459,4,FALSE)=\"S\", \"\", VLOOKUP(A24,Calendar!$A$3:$G$459,4,FALSE)))),\"\",IF(Summary!$B$5=3,IF(VLOOKUP(A24,Calendar!$A$3:$G$459,7,FALSE)=\"S\", \"\", VLOOKUP(A24,Calendar!$A$3:$G$459,7,FALSE)),IF(VLOOKUP(A24,Calendar!$A$3:$G$459,4,FALSE)=\"S\", \"\", VLOOKUP(A24,Calendar!$A$3:$G$459,4,FALSE))))","v":""},{"$f":"IF(Summary!$B$5=3,IF(C24=\"\",\"\",VLOOKUP(A24,Calendar!$A$3:$G$459,5,FALSE)),IF(C24=\"\",\"\",VLOOKUP(A24,Calendar!$A$3:$G$459,2,FALSE)))","v":""},null,null,null,null,0,null,null,""]
[217,null,{"$f":"IF(ISNA(IF(Summary!$B$5=3,IF(VLOOKUP(A25,Calendar!$A$3:$G$459,7,FALSE)=\"S\", \"\", VLOOKUP(A25,Calendar!$A$3:$G$459,7,FALSE)),IF(VLOOKUP(A25,Calendar!$A$3:$G$459,4,FALSE)=\"S\", \"\", VLOOKUP(A25,Calendar!$A$3:$G$459,4,FALSE)))),\"\",IF(Summary!$B$5=3,IF(VLOOKUP(A25,Calendar!$A$3:$G$459,7,FALSE)=\"S\", \"\", VLOOKUP(A25,Calendar!$A$3:$G$459,7,FALSE)),IF(VLOOKUP(A25,Calendar!$A$3:$G$459,4,FALSE)=\"S\", \"\", VLOOKUP(A25,Calendar!$A$3:$G$459,4,FALSE))))","v":"M"},{"$f":"IF(Summary!$B$5=3,IF(C25=\"\",\"\",VLOOKUP(A25,Calendar!$A$3:$G$459,5,FALSE)),IF(C25=\"\",\"\",VLOOKUP(A25,Calendar!$A$3:$G$459,2,FALSE)))","v":"2020-02-17"},null,null,null,null,0,null,null,""]
[218,null,{"$f":"IF(ISNA(IF(Summary!$B$5=3,IF(VLOOKUP(A26,Calendar!$A$3:$G$459,7,FALSE)=\"S\", \"\", VLOOKUP(A26,Calendar!$A$3:$G$459,7,FALSE)),IF(VLOOKUP(A26,Calendar!$A$3:$G$459,4,FALSE)=\"S\", \"\", VLOOKUP(A26,Calendar!$A$3:$G$459,4,FALSE)))),\"\",IF(Summary!$B$5=3,IF(VLOOKUP(A26,Calendar!$A$3:$G$459,7,FALSE)=\"S\", \"\", VLOOKUP(A26,Calendar!$A$3:$G$459,7,FALSE)),IF(VLOOKUP(A26,Calendar!$A$3:$G$459,4,FALSE)=\"S\", \"\", VLOOKUP(A26,Calendar!$A$3:$G$459,4,FALSE))))","v":"T"},{"$f":"IF(Summary!$B$5=3,IF(C26=\"\",\"\",VLOOKUP(A26,Calendar!$A$3:$G$459,5,FALSE)),IF(C26=\"\",\"\",VLOOKUP(A26,Calendar!$A$3:$G$459,2,FALSE)))","v":"2020-02-18"},null,null,null,null,0,null,null,""]
[219,null,{"$f":"IF(ISNA(IF(Summary!$B$5=3,IF(VLOOKUP(A27,Calendar!$A$3:$G$459,7,FALSE)=\"S\", \"\", VLOOKUP(A27,Calendar!$A$3:$G$459,7,FALSE)),IF(VLOOKUP(A27,Calendar!$A$3:$G$459,4,FALSE)=\"S\", \"\", VLOOKUP(A27,Calendar!$A$3:$G$459,4,FALSE)))),\"\",IF(Summary!$B$5=3,IF(VLOOKUP(A27,Calendar!$A$3:$G$459,7,FALSE)=\"S\", \"\", VLOOKUP(A27,Calendar!$A$3:$G$459,7,FALSE)),IF(VLOOKUP(A27,Calendar!$A$3:$G$459,4,FALSE)=\"S\", \"\", VLOOKUP(A27,Calendar!$A$3:$G$459,4,FALSE))))","v":"W"},{"$f":"IF(Summary!$B$5=3,IF(C27=\"\",\"\",VLOOKUP(A27,Calendar!$A$3:$G$459,5,FALSE)),IF(C27=\"\",\"\",VLOOKUP(A27,Calendar!$A$3:$G$459,2,FALSE)))","v":"2020-02-19"},null,null,null,null,0,null,null,""]
[220,null,{"$f":"IF(ISNA(IF(Summary!$B$5=3,IF(VLOOKUP(A28,Calendar!$A$3:$G$459,7,FALSE)=\"S\", \"\", VLOOKUP(A28,Calendar!$A$3:$G$459,7,FALSE)),IF(VLOOKUP(A28,Calendar!$A$3:$G$459,4,FALSE)=\"S\", \"\", VLOOKUP(A28,Calendar!$A$3:$G$459,4,FALSE)))),\"\",IF(Summary!$B$5=3,IF(VLOOKUP(A28,Calendar!$A$3:$G$459,7,FALSE)=\"S\", \"\", VLOOKUP(A28,Calendar!$A$3:$G$459,7,FALSE)),IF(VLOOKUP(A28,Calendar!$A$3:$G$459,4,FALSE)=\"S\", \"\", VLOOKUP(A28,Calendar!$A$3:$G$459,4,FALSE))))","v":"R"},{"$f":"IF(Summary!$B$5=3,IF(C28=\"\",\"\",VLOOKUP(A28,Calendar!$A$3:$G$459,5,FALSE)),IF(C28=\"\",\"\",VLOOKUP(A28,Calendar!$A$3:$G$459,2,FALSE)))","v":"2020-02-20"},null,null,null,null,0,null,null,""]
[221,null,{"$f":"IF(ISNA(IF(Summary!$B$5=3,IF(VLOOKUP(A29,Calendar!$A$3:$G$459,7,FALSE)=\"S\", \"\", VLOOKUP(A29,Calendar!$A$3:$G$459,7,FALSE)),IF(VLOOKUP(A29,Calendar!$A$3:$G$459,4,FALSE)=\"S\", \"\", VLOOKUP(A29,Calendar!$A$3:$G$459,4,FALSE)))),\"\",IF(Summary!$B$5=3,IF(VLOOKUP(A29,Calendar!$A$3:$G$459,7,FALSE)=\"S\", \"\", VLOOKUP(A29,Calendar!$A$3:$G$459,7,FALSE)),IF(VLOOKUP(A29,Calendar!$A$3:$G$459,4,FALSE)=\"S\", \"\", VLOOKUP(A29,Calendar!$A$3:$G$459,4,FALSE))))","v":"F"},{"$f":"IF(Summary!$B$5=3,IF(C29=\"\",\"\",VLOOKUP(A29,Calendar!$A$3:$G$459,5,FALSE)),IF(C29=\"\",\"\",VLOOKUP(A29,Calendar!$A$3:$G$459,2,FALSE)))","v":"2020-02-21"},null,null,null,null,0,null,null,""]
[222,null,{"$f":"IF(ISNA(IF(Summary!$B$5=3,IF(VLOOKUP(A30,Calendar!$A$3:$G$459,7,FALSE)=\"S\", \"\", VLOOKUP(A30,Calendar!$A$3:$G$459,7,FALSE)),IF(VLOOKUP(A30,Calendar!$A$3:$G$459,4,FALSE)=\"S\", \"\", VLOOKUP(A30,Calendar!$A$3:$G$459,4,FALSE)))),\"\",IF(Summary!$B$5=3,IF(VLOOKUP(A30,Calendar!$A$3:$G$459,7,FALSE)=\"S\", \"\", VLOOKUP(A30,Calendar!$A$3:$G$459,7,FALSE)),IF(VLOOKUP(A30,Calendar!$A$3:$G$459,4,FALSE)=\"S\", \"\", VLOOKUP(A30,Calendar!$A$3:$G$459,4,FALSE))))","v":""},{"$f":"IF(Summary!$B$5=3,IF(C30=\"\",\"\",VLOOKUP(A30,Calendar!$A$3:$G$459,5,FALSE)),IF(C30=\"\",\"\",VLOOKUP(A30,Calendar!$A$3:$G$459,2,FALSE)))","v":""},null,null,null,null,0,null,null,""]
[223,null,{"$f":"IF(ISNA(IF(Summary!$B$5=3,IF(VLOOKUP(A31,Calendar!$A$3:$G$459,7,FALSE)=\"S\", \"\", VLOOKUP(A31,Calendar!$A$3:$G$459,7,FALSE)),IF(VLOOKUP(A31,Calendar!$A$3:$G$459,4,FALSE)=\"S\", \"\", VLOOKUP(A31,Calendar!$A$3:$G$459,4,FALSE)))),\"\",IF(Summary!$B$5=3,IF(VLOOKUP(A31,Calendar!$A$3:$G$459,7,FALSE)=\"S\", \"\", VLOOKUP(A31,Calendar!$A$3:$G$459,7,FALSE)),IF(VLOOKUP(A31,Calendar!$A$3:$G$459,4,FALSE)=\"S\", \"\", VLOOKUP(A31,Calendar!$A$3:$G$459,4,FALSE))))","v":""},{"$f":"IF(Summary!$B$5=3,IF(C31=\"\",\"\",VLOOKUP(A31,Calendar!$A$3:$G$459,5,FALSE)),IF(C31=\"\",\"\",VLOOKUP(A31,Calendar!$A$3:$G$459,2,FALSE)))","v":""},null,null,null,null,0,null,null,""]
[224,null,{"$f":"IF(ISNA(IF(Summary!$B$5=3,IF(VLOOKUP(A32,Calendar!$A$3:$G$459,7,FALSE)=\"S\", \"\", VLOOKUP(A32,Calendar!$A$3:$G$459,7,FALSE)),IF(VLOOKUP(A32,Calendar!$A$3:$G$459,4,FALSE)=\"S\", \"\", VLOOKUP(A32,Calendar!$A$3:$G$459,4,FALSE)))),\"\",IF(Summary!$B$5=3,IF(VLOOKUP(A32,Calendar!$A$3:$G$459,7,FALSE)=\"S\", \"\", VLOOKUP(A32,Calendar!$A$3:$G$459,7,FALSE)),IF(VLOOKUP(A32,Calendar!$A$3:$G$459,4,FALSE)=\"S\", \"\", VLOOKUP(A32,Calendar!$A$3:$G$459,4,FALSE))))","v":"M"},{"$f":"IF(Summary!$B$5=3,IF(C32=\"\",\"\",VLOOKUP(A32,Calendar!$A$3:$G$459,5,FALSE)),IF(C32=\"\",\"\",VLOOKUP(A32,Calendar!$A$3:$G$459,2,FALSE)))","v":"2020-02-24"},null,null,null,null,0,null,null,""]
[225,null,{"$f":"IF(ISNA(IF(Summary!$B$5=3,IF(VLOOKUP(A33,Calendar!$A$3:$G$459,7,FALSE)=\"S\", \"\", VLOOKUP(A33,Calendar!$A$3:$G$459,7,FALSE)),IF(VLOOKUP(A33,Calendar!$A$3:$G$459,4,FALSE)=\"S\", \"\", VLOOKUP(A33,Calendar!$A$3:$G$459,4,FALSE)))),\"\",IF(Summary!$B$5=3,IF(VLOOKUP(A33,Calendar!$A$3:$G$459,7,FALSE)=\"S\", \"\", VLOOKUP(A33,Calendar!$A$3:$G$459,7,FALSE)),IF(VLOOKUP(A33,Calendar!$A$3:$G$459,4,FALSE)=\"S\", \"\", VLOOKUP(A33,Calendar!$A$3:$G$459,4,FALSE))))","v":"T"},{"$f":"IF(Summary!$B$5=3,IF(C33=\"\",\"\",VLOOKUP(A33,Calendar!$A$3:$G$459,5,FALSE)),IF(C33=\"\",\"\",VLOOKUP(A33,Calendar!$A$3:$G$459,2,FALSE)))","v":"2020-02-25"},null,null,null,null,0,null,null,""]
[226,null,{"$f":"IF(ISNA(IF(Summary!$B$5=3,IF(VLOOKUP(A34,Calendar!$A$3:$G$459,7,FALSE)=\"S\", \"\", VLOOKUP(A34,Calendar!$A$3:$G$459,7,FALSE)),IF(VLOOKUP(A34,Calendar!$A$3:$G$459,4,FALSE)=\"S\", \"\", VLOOKUP(A34,Calendar!$A$3:$G$459,4,FALSE)))),\"\",IF(Summary!$B$5=3,IF(VLOOKUP(A34,Calendar!$A$3:$G$459,7,FALSE)=\"S\", \"\", VLOOKUP(A34,Calendar!$A$3:$G$459,7,FALSE)),IF(VLOOKUP(A34,Calendar!$A$3:$G$459,4,FALSE)=\"S\", \"\", VLOOKUP(A34,Calendar!$A$3:$G$459,4,FALSE))))","v":"W"},{"$f":"IF(Summary!$B$5=3,IF(C34=\"\",\"\",VLOOKUP(A34,Calendar!$A$3:$G$459,5,FALSE)),IF(C34=\"\",\"\",VLOOKUP(A34,Calendar!$A$3:$G$459,2,FALSE)))","v":"2020-02-26"},null,null,null,null,0,null,null,""]
[227,null,{"$f":"IF(ISNA(IF(Summary!$B$5=3,IF(VLOOKUP(A35,Calendar!$A$3:$G$459,7,FALSE)=\"S\", \"\", VLOOKUP(A35,Calendar!$A$3:$G$459,7,FALSE)),IF(VLOOKUP(A35,Calendar!$A$3:$G$459,4,FALSE)=\"S\", \"\", VLOOKUP(A35,Calendar!$A$3:$G$459,4,FALSE)))),\"\",IF(Summary!$B$5=3,IF(VLOOKUP(A35,Calendar!$A$3:$G$459,7,FALSE)=\"S\", \"\", VLOOKUP(A35,Calendar!$A$3:$G$459,7,FALSE)),IF(VLOOKUP(A35,Calendar!$A$3:$G$459,4,FALSE)=\"S\", \"\", VLOOKUP(A35,Calendar!$A$3:$G$459,4,FALSE))))","v":"R"},{"$f":"IF(Summary!$B$5=3,IF(C35=\"\",\"\",VLOOKUP(A35,Calendar!$A$3:$G$459,5,FALSE)),IF(C35=\"\",\"\",VLOOKUP(A35,Calendar!$A$3:$G$459,2,FALSE)))","v":"2020-02-27"},null,null,null,null,0,null,null,""]
[228,null,{"$f":"IF(ISNA(IF(Summary!$B$5=3,IF(VLOOKUP(A36,Calendar!$A$3:$G$459,7,FALSE)=\"S\", \"\", VLOOKUP(A36,Calendar!$A$3:$G$459,7,FALSE)),IF(VLOOKUP(A36,Calendar!$A$3:$G$459,4,FALSE)=\"S\", \"\", VLOOKUP(A36,Calendar!$A$3:$G$459,4,FALSE)))),\"\",IF(Summary!$B$5=3,IF(VLOOKUP(A36,Calendar!$A$3:$G$459,7,FALSE)=\"S\", \"\", VLOOKUP(A36,Calendar!$A$3:$G$459,7,FALSE)),IF(VLOOKUP(A36,Calendar!$A$3:$G$459,4,FALSE)=\"S\", \"\", VLOOKUP(A36,Calendar!$A$3:$G$459,4,FALSE))))","v":"F"},{"$f":"IF(Summary!$B$5=3,IF(C36=\"\",\"\",VLOOKUP(A36,Calendar!$A$3:$G$459,5,FALSE)),IF(C36=\"\",\"\",VLOOKUP(A36,Calendar!$A$3:$G$459,2,FALSE)))","v":"2020-02-28"},null,null,null,null,0,null,null,""]
[229,null,{"$f":"IF(ISNA(IF(Summary!$B$5=3,IF(VLOOKUP(A37,Calendar!$A$3:$G$459,7,FALSE)=\"S\", \"\", VLOOKUP(A37,Calendar!$A$3:$G$459,7,FALSE)),IF(VLOOKUP(A37,Calendar!$A$3:$G$459,4,FALSE)=\"S\", \"\", VLOOKUP(A37,Calendar!$A$3:$G$459,4,FALSE)))),\"\",IF(Summary!$B$5=3,IF(VLOOKUP(A37,Calendar!$A$3:$G$459,7,FALSE)=\"S\", \"\", VLOOKUP(A37,Calendar!$A$3:$G$459,7,FALSE)),IF(VLOOKUP(A37,Calendar!$A$3:$G$459,4,FALSE)=\"S\", \"\", VLOOKUP(A37,Calendar!$A$3:$G$459,4,FALSE))))","v":""},{"$f":"IF(Summary!$B$5=3,IF(C37=\"\",\"\",VLOOKUP(A37,Calendar!$A$3:$G$459,5,FALSE)),IF(C37=\"\",\"\",VLOOKUP(A37,Calendar!$A$3:$G$459,4,FALSE)))","v":""},null,null,null,null,0,null,null,""]
[null,null,{"$f":"IF(ISNA(IF(Summary!$B$5=3,IF(VLOOKUP(A38,Calendar!$A$3:$G$459,7,FALSE)=\"S\", \"\", VLOOKUP(A38,Calendar!$A$3:$G$459,7,FALSE)),IF(VLOOKUP(A38,Calendar!$A$3:$G$459,4,FALSE)=\"S\", \"\", VLOOKUP(A38,Calendar!$A$3:$G$459,4,FALSE)))),\"\",IF(Summary!$B$5=3,IF(VLOOKUP(A38,Calendar!$A$3:$G$459,7,FALSE)=\"S\", \"\", VLOOKUP(A38,Calendar!$A$3:$G$459,7,FALSE)),IF(VLOOKUP(A38,Calendar!$A$3:$G$459,4,FALSE)=\"S\", \"\", VLOOKUP(A38,Calendar!$A$3:$G$459,4,FALSE))))","v":""},{"$f":"IF(Summary!$B$5=3,IF(C38=\"\",\"\",VLOOKUP(A38,Calendar!$A$3:$G$459,5,FALSE)),IF(C38=\"\",\"\",VLOOKUP(A38,Calendar!$A$3:$G$459,2,FALSE)))","v":""},null,null,null,null,0,null,null,""]
[null,null,{"$f":"IF(ISNA(IF(Summary!$B$5=3,IF(VLOOKUP(A39,Calendar!$A$3:$G$459,7,FALSE)=\"S\", \"\", VLOOKUP(A39,Calendar!$A$3:$G$459,7,FALSE)),IF(VLOOKUP(A39,Calendar!$A$3:$G$459,4,FALSE)=\"S\", \"\", VLOOKUP(A39,Calendar!$A$3:$G$459,4,FALSE)))),\"\",IF(Summary!$B$5=3,IF(VLOOKUP(A39,Calendar!$A$3:$G$459,7,FALSE)=\"S\", \"\", VLOOKUP(A39,Calendar!$A$3:$G$459,7,FALSE)),IF(VLOOKUP(A39,Calendar!$A$3:$G$459,4,FALSE)=\"S\", \"\", VLOOKUP(A39,Calendar!$A$3:$G$459,4,FALSE))))","v":""},{"$f":"IF(Summary!$B$5=3,IF(C39=\"\",\"\",VLOOKUP(A39,Calendar!$A$3:$G$459,5,FALSE)),IF(C39=\"\",\"\",VLOOKUP(A39,Calendar!$A$3:$G$459,2,FALSE)))","v":""},null,null,null,null,0,null,null,""]
[null,null,null,"Total Minutes",{"$f":"SUM(E9:E39)","v":0},{"$f":"SUM(F9:F39)","v":0},0,0,0,null,null,{"$f":"IF(SUM(E40:H40)>COUNTA(E9:E39)*390,\"The sum total for all cost objectives exceeds the maximum anticipated value based upon the number of days worked. Confirm minutes claimed for each day.\",\"\")","v":""}]
[null,null,null,"Total Hours",{"$f":"E40/60","v":0},{"$f":"F40/60","v":0},0,0,0]
[]
[]
[null,null,"Notes"]
[]
[]
[]
[]
[]
[]
[]
[]
[]
[]
[]
[null,null,null,null,"Kansas State Department of Education",null,null,null,"Personnel Activity Report"]
[null,null,null,null,"Fiscal Auditing",null,null,null,"Updated 9/20/18"]
[null,null,null,null,"785-296-4976"]
[null,null,null,null,"https://www.ksde.org/Agency/Fiscal-and-Administrative-Services/Fiscal-Auditing"]
[]
[]
[null,null,"The Kansas State Department of Education does not discriminate on the basis of race, color, national origin, sex, disability, or age in its programs and activities and provides equal access to the Boy Scouts and other designated youth groups. The following person has been designated to handle inquiries regarding the nondiscrimination policies: KSDE General Counsel, Office of General Counsel, KSDE, Landon State Office Building, 900 S.W. Jackson, Suite 102, Topeka, KS 66612, (785) 296-3204."]

{"sheet":"March","index":10,"n_rows":62,"n_cols":12,"rows_kept":62,"cut":false,"hidden":false,"merged":[[61,2,62,8],[1,2,1,8],[2,2,2,8],[3,2,3,8],[4,2,4,8],[46,2,46,8],[47,2,47,8],[48,2,48,8],[49,2,49,8],[5,2,5,8],[6,2,6,8],[43,3,43,8],[44,2,44,8],[45,2,45,8]]}
[]
[]
[null,null,"Personnel Activity Report"]
[null,null,"Regular School Year"]
[null,null,"March"]
[null,null,{"$f":"IF(Summary!$E$8<>\"\",Summary!$E$8,\" \")","v":" "}]
[null,null,{"$f":"IF(Summary!$E$9<>\"\",Summary!$E$9,\" \")","v":" "}]
[null,null,"Day","Date","Special Ed","General Ed","Other","Other","Totals",null,null,{"$f":"IF(OR(AND(F8=\"\",COUNTA(F9:F39)>0),AND(G8=\"\",COUNTA(G9:G39)>0),AND(H8=\"\",COUNTA(H9:H39)>0)),\"<<< You must identify the cost objective in the column heading.\",\"\")","v":""}]
[301,null,{"$f":"IF(ISNA(IF(Summary!$B$5=3,IF(VLOOKUP(A9,Calendar!$A$3:$G$459,7,FALSE)=\"S\", \"\", VLOOKUP(A9,Calendar!$A$3:$G$459,7,FALSE)),IF(VLOOKUP(A9,Calendar!$A$3:$G$459,4,FALSE)=\"S\", \"\", VLOOKUP(A9,Calendar!$A$3:$G$459,4,FALSE)))),\"\",IF(Summary!$B$5=3,IF(VLOOKUP(A9,Calendar!$A$3:$G$459,7,FALSE)=\"S\", \"\", VLOOKUP(A9,Calendar!$A$3:$G$459,7,FALSE)),IF(VLOOKUP(A9,Calendar!$A$3:$G$459,4,FALSE)=\"S\", \"\", VLOOKUP(A9,Calendar!$A$3:$G$459,4,FALSE))))","v":""},{"$f":"IF(Summary!$B$5=3,IF(C9=\"\",\"\",VLOOKUP(A9,Calendar!$A$3:$G$459,5,FALSE)),IF(C9=\"\",\"\",VLOOKUP(A9,Calendar!$A$3:$G$459,2,FALSE)))","v":""},null,null,null,null,{"$f":"MIN(1440,SUM(E9:H9))","v":0},null,null,{"$f":"IF(I9>390, \"<<< Day exceeds 390 minutes. Confirm reported time.\",\"\")","v":""}]
[302,null,{"$f":"IF(ISNA(IF(Summary!$B$5=3,IF(VLOOKUP(A10,Calendar!$A$3:$G$459,7,FALSE)=\"S\", \"\", VLOOKUP(A10,Calendar!$A$3:$G$459,7,FALSE)),IF(VLOOKUP(A10,Calendar!$A$3:$G$459,4,FALSE)=\"S\", \"\", VLOOKUP(A10,Calendar!$A$3:$G$459,4,FALSE)))),\"\",IF(Summary!$B$5=3,IF(VLOOKUP(A10,Calendar!$A$3:$G$459,7,FALSE)=\"S\", \"\", VLOOKUP(A10,Calendar!$A$3:$G$459,7,FALSE)),IF(VLOOKUP(A10,Calendar!$A$3:$G$459,4,FALSE)=\"S\", \"\", VLOOKUP(A10,Calendar!$A$3:$G$459,4,FALSE))))","v":"M"},{"$f":"IF(Summary!$B$5=3,IF(C10=\"\",\"\",VLOOKUP(A10,Calendar!$A$3:$G$459,5,FALSE)),IF(C10=\"\",\"\",VLOOKUP(A10,Calendar!$A$3:$G$459,2,FALSE)))","v":"2020-03-02"},null,null,null,null,{"$f":"MIN(1440,SUM(E10:H10))","v":0},null,null,{"$f":"IF(I10>390, \"<<< Day exceeds 390 minutes. Confirm reported time.\",\"\")","v":""}]
[303,null,{"$f":"IF(ISNA(IF(Summary!$B$5=3,IF(VLOOKUP(A11,Calendar!$A$3:$G$459,7,FALSE)=\"S\", \"\", VLOOKUP(A11,Calendar!$A$3:$G$459,7,FALSE)),IF(VLOOKUP(A11,Calendar!$A$3:$G$459,4,FALSE)=\"S\", \"\", VLOOKUP(A11,Calendar!$A$3:$G$459,4,FALSE)))),\"\",IF(Summary!$B$5=3,IF(VLOOKUP(A11,Calendar!$A$3:$G$459,7,FALSE)=\"S\", \"\", VLOOKUP(A11,Calendar!$A$3:$G$459,7,FALSE)),IF(VLOOKUP(A11,Calendar!$A$3:$G$459,4,FALSE)=\"S\", \"\", VLOOKUP(A11,Calendar!$A$3:$G$459,4,FALSE))))","v":"T"},{"$f":"IF(Summary!$B$5=3,IF(C11=\"\",\"\",VLOOKUP(A11,Calendar!$A$3:$G$459,5,FALSE)),IF(C11=\"\",\"\",VLOOKUP(A11,Calendar!$A$3:$G$459,2,FALSE)))","v":"2020-03-03"},null,null,null,null,0,null,null,""]
[304,null,{"$f":"IF(ISNA(IF(Summary!$B$5=3,IF(VLOOKUP(A12,Calendar!$A$3:$G$459,7,FALSE)=\"S\", \"\", VLOOKUP(A12,Calendar!$A$3:$G$459,7,FALSE)),IF(VLOOKUP(A12,Calendar!$A$3:$G$459,4,FALSE)=\"S\", \"\", VLOOKUP(A12,Calendar!$A$3:$G$459,4,FALSE)))),\"\",IF(Summary!$B$5=3,IF(VLOOKUP(A12,Calendar!$A$3:$G$459,7,FALSE)=\"S\", \"\", VLOOKUP(A12,Calendar!$A$3:$G$459,7,FALSE)),IF(VLOOKUP(A12,Calendar!$A$3:$G$459,4,FALSE)=\"S\", \"\", VLOOKUP(A12,Calendar!$A$3:$G$459,4,FALSE))))","v":"W"},{"$f":"IF(Summary!$B$5=3,IF(C12=\"\",\"\",VLOOKUP(A12,Calendar!$A$3:$G$459,5,FALSE)),IF(C12=\"\",\"\",VLOOKUP(A12,Calendar!$A$3:$G$459,2,FALSE)))","v":"2020-03-04"},null,null,null,null,0,null,null,""]
[305,null,{"$f":"IF(ISNA(IF(Summary!$B$5=3,IF(VLOOKUP(A13,Calendar!$A$3:$G$459,7,FALSE)=\"S\", \"\", VLOOKUP(A13,Calendar!$A$3:$G$459,7,FALSE)),IF(VLOOKUP(A13,Calendar!$A$3:$G$459,4,FALSE)=\"S\", \"\", VLOOKUP(A13,Calendar!$A$3:$G$459,4,FALSE)))),\"\",IF(Summary!$B$5=3,IF(VLOOKUP(A13,Calendar!$A$3:$G$459,7,FALSE)=\"S\", \"\", VLOOKUP(A13,Calendar!$A$3:$G$459,7,FALSE)),IF(VLOOKUP(A13,Calendar!$A$3:$G$459,4,FALSE)=\"S\", \"\", VLOOKUP(A13,Calendar!$A$3:$G$459,4,FALSE))))","v":"R"},{"$f":"IF(Summary!$B$5=3,IF(C13=\"\",\"\",VLOOKUP(A13,Calendar!$A$3:$G$459,5,FALSE)),IF(C13=\"\",\"\",VLOOKUP(A13,Calendar!$A$3:$G$459,2,FALSE)))","v":"2020-03-05"},null,null,null,null,0,null,null,""]
[306,null,{"$f":"IF(ISNA(IF(Summary!$B$5=3,IF(VLOOKUP(A14,Calendar!$A$3:$G$459,7,FALSE)=\"S\", \"\", VLOOKUP(A14,Calendar!$A$3:$G$459,7,FALSE)),IF(VLOOKUP(A14,Calendar!$A$3:$G$459,4,FALSE)=\"S\", \"\", VLOOKUP(A14,Calendar!$A$3:$G$459,4,FALSE)))),\"\",IF(Summary!$B$5=3,IF(VLOOKUP(A14,Calendar!$A$3:$G$459,7,FALSE)=\"S\", \"\", VLOOKUP(A14,Calendar!$A$3:$G$459,7,FALSE)),IF(VLOOKUP(A14,Calendar!$A$3:$G$459,4,FALSE)=\"S\", \"\", VLOOKUP(A14,Calendar!$A$3:$G$459,4,FALSE))))","v":"F"},{"$f":"IF(Summary!$B$5=3,IF(C14=\"\",\"\",VLOOKUP(A14,Calendar!$A$3:$G$459,5,FALSE)),IF(C14=\"\",\"\",VLOOKUP(A14,Calendar!$A$3:$G$459,2,FALSE)))","v":"2020-03-06"},null,null,null,null,0,null,null,""]
[307,null,{"$f":"IF(ISNA(IF(Summary!$B$5=3,IF(VLOOKUP(A15,Calendar!$A$3:$G$459,7,FALSE)=\"S\", \"\", VLOOKUP(A15,Calendar!$A$3:$G$459,7,FALSE)),IF(VLOOKUP(A15,Calendar!$A$3:$G$459,4,FALSE)=\"S\", \"\", VLOOKUP(A15,Calendar!$A$3:$G$459,4,FALSE)))),\"\",IF(Summary!$B$5=3,IF(VLOOKUP(A15,Calendar!$A$3:$G$459,7,FALSE)=\"S\", \"\", VLOOKUP(A15,Calendar!$A$3:$G$459,7,FALSE)),IF(VLOOKUP(A15,Calendar!$A$3:$G$459,4,FALSE)=\"S\", \"\", VLOOKUP(A15,Calendar!$A$3:$G$459,4,FALSE))))","v":""},{"$f":"IF(Summary!$B$5=3,IF(C15=\"\",\"\",VLOOKUP(A15,Calendar!$A$3:$G$459,5,FALSE)),IF(C15=\"\",\"\",VLOOKUP(A15,Calendar!$A$3:$G$459,2,FALSE)))","v":""},null,null,null,null,0,null,null,""]
[308,null,{"$f":"IF(ISNA(IF(Summary!$B$5=3,IF(VLOOKUP(A16,Calendar!$A$3:$G$459,7,FALSE)=\"S\", \"\", VLOOKUP(A16,Calendar!$A$3:$G$459,7,FALSE)),IF(VLOOKUP(A16,Calendar!$A$3:$G$459,4,FALSE)=\"S\", \"\", VLOOKUP(A16,Calendar!$A$3:$G$459,4,FALSE)))),\"\",IF(Summary!$B$5=3,IF(VLOOKUP(A16,Calendar!$A$3:$G$459,7,FALSE)=\"S\", \"\", VLOOKUP(A16,Calendar!$A$3:$G$459,7,FALSE)),IF(VLOOKUP(A16,Calendar!$A$3:$G$459,4,FALSE)=\"S\", \"\", VLOOKUP(A16,Calendar!$A$3:$G$459,4,FALSE))))","v":""},{"$f":"IF(Summary!$B$5=3,IF(C16=\"\",\"\",VLOOKUP(A16,Calendar!$A$3:$G$459,5,FALSE)),IF(C16=\"\",\"\",VLOOKUP(A16,Calendar!$A$3:$G$459,2,FALSE)))","v":""},null,null,null,null,0,null,null,""]
[309,null,{"$f":"IF(ISNA(IF(Summary!$B$5=3,IF(VLOOKUP(A17,Calendar!$A$3:$G$459,7,FALSE)=\"S\", \"\", VLOOKUP(A17,Calendar!$A$3:$G$459,7,FALSE)),IF(VLOOKUP(A17,Calendar!$A$3:$G$459,4,FALSE)=\"S\", \"\", VLOOKUP(A17,Calendar!$A$3:$G$459,4,FALSE)))),\"\",IF(Summary!$B$5=3,IF(VLOOKUP(A17,Calendar!$A$3:$G$459,7,FALSE)=\"S\", \"\", VLOOKUP(A17,Calendar!$A$3:$G$459,7,FALSE)),IF(VLOOKUP(A17,Calendar!$A$3:$G$459,4,FALSE)=\"S\", \"\", VLOOKUP(A17,Calendar!$A$3:$G$459,4,FALSE))))","v":"M"},{"$f":"IF(Summary!$B$5=3,IF(C17=\"\",\"\",VLOOKUP(A17,Calendar!$A$3:$G$459,5,FALSE)),IF(C17=\"\",\"\",VLOOKUP(A17,Calendar!$A$3:$G$459,2,FALSE)))","v":"2020-03-09"},null,null,null,null,0,null,null,""]
[310,null,{"$f":"IF(ISNA(IF(Summary!$B$5=3,IF(VLOOKUP(A18,Calendar!$A$3:$G$459,7,FALSE)=\"S\", \"\", VLOOKUP(A18,Calendar!$A$3:$G$459,7,FALSE)),IF(VLOOKUP(A18,Calendar!$A$3:$G$459,4,FALSE)=\"S\", \"\", VLOOKUP(A18,Calendar!$A$3:$G$459,4,FALSE)))),\"\",IF(Summary!$B$5=3,IF(VLOOKUP(A18,Calendar!$A$3:$G$459,7,FALSE)=\"S\", \"\", VLOOKUP(A18,Calendar!$A$3:$G$459,7,FALSE)),IF(VLOOKUP(A18,Calendar!$A$3:$G$459,4,FALSE)=\"S\", \"\", VLOOKUP(A18,Calendar!$A$3:$G$459,4,FALSE))))","v":"T"},{"$f":"IF(Summary!$B$5=3,IF(C18=\"\",\"\",VLOOKUP(A18,Calendar!$A$3:$G$459,5,FALSE)),IF(C18=\"\",\"\",VLOOKUP(A18,Calendar!$A$3:$G$459,2,FALSE)))","v":"2020-03-10"},null,null,null,null,0,null,null,""]
[311,null,{"$f":"IF(ISNA(IF(Summary!$B$5=3,IF(VLOOKUP(A19,Calendar!$A$3:$G$459,7,FALSE)=\"S\", \"\", VLOOKUP(A19,Calendar!$A$3:$G$459,7,FALSE)),IF(VLOOKUP(A19,Calendar!$A$3:$G$459,4,FALSE)=\"S\", \"\", VLOOKUP(A19,Calendar!$A$3:$G$459,4,FALSE)))),\"\",IF(Summary!$B$5=3,IF(VLOOKUP(A19,Calendar!$A$3:$G$459,7,FALSE)=\"S\", \"\", VLOOKUP(A19,Calendar!$A$3:$G$459,7,FALSE)),IF(VLOOKUP(A19,Calendar!$A$3:$G$459,4,FALSE)=\"S\", \"\", VLOOKUP(A19,Calendar!$A$3:$G$459,4,FALSE))))","v":"W"},{"$f":"IF(Summary!$B$5=3,IF(C19=\"\",\"\",VLOOKUP(A19,Calendar!$A$3:$G$459,5,FALSE)),IF(C19=\"\",\"\",VLOOKUP(A19,Calendar!$A$3:$G$459,2,FALSE)))","v":"2020-03-11"},null,null,null,null,0,null,null,""]
[312,null,{"$f":"IF(ISNA(IF(Summary!$B$5=3,IF(VLOOKUP(A20,Calendar!$A$3:$G$459,7,FALSE)=\"S\", \"\", VLOOKUP(A20,Calendar!$A$3:$G$459,7,FALSE)),IF(VLOOKUP(A20,Calendar!$A$3:$G$459,4,FALSE)=\"S\", \"\", VLOOKUP(A20,Calendar!$A$3:$G$459,4,FALSE)))),\"\",IF(Summary!$B$5=3,IF(VLOOKUP(A20,Calendar!$A$3:$G$459,7,FALSE)=\"S\", \"\", VLOOKUP(A20,Calendar!$A$3:$G$459,7,FALSE)),IF(VLOOKUP(A20,Calendar!$A$3:$G$459,4,FALSE)=\"S\", \"\", VLOOKUP(A20,Calendar!$A$3:$G$459,4,FALSE))))","v":"R"},{"$f":"IF(Summary!$B$5=3,IF(C20=\"\",\"\",VLOOKUP(A20,Calendar!$A$3:$G$459,5,FALSE)),IF(C20=\"\",\"\",VLOOKUP(A20,Calendar!$A$3:$G$459,2,FALSE)))","v":"2020-03-12"},null,null,null,null,0,null,null,""]
[313,null,{"$f":"IF(ISNA(IF(Summary!$B$5=3,IF(VLOOKUP(A21,Calendar!$A$3:$G$459,7,FALSE)=\"S\", \"\", VLOOKUP(A21,Calendar!$A$3:$G$459,7,FALSE)),IF(VLOOKUP(A21,Calendar!$A$3:$G$459,4,FALSE)=\"S\", \"\", VLOOKUP(A21,Calendar!$A$3:$G$459,4,FALSE)))),\"\",IF(Summary!$B$5=3,IF(VLOOKUP(A21,Calendar!$A$3:$G$459,7,FALSE)=\"S\", \"\", VLOOKUP(A21,Calendar!$A$3:$G$459,7,FALSE)),IF(VLOOKUP(A21,Calendar!$A$3:$G$459,4,FALSE)=\"S\", \"\", VLOOKUP(A21,Calendar!$A$3:$G$459,4,FALSE))))","v":"F"},{"$f":"IF(Summary!$B$5=3,IF(C21=\"\",\"\",VLOOKUP(A21,Calendar!$A$3:$G$459,5,FALSE)),IF(C21=\"\",\"\",VLOOKUP(A21,Calendar!$A$3:$G$459,2,FALSE)))","v":"2020-03-13"},null,null,null,null,0,null,null,""]
[314,null,{"$f":"IF(ISNA(IF(Summary!$B$5=3,IF(VLOOKUP(A22,Calendar!$A$3:$G$459,7,FALSE)=\"S\", \"\", VLOOKUP(A22,Calendar!$A$3:$G$459,7,FALSE)),IF(VLOOKUP(A22,Calendar!$A$3:$G$459,4,FALSE)=\"S\", \"\", VLOOKUP(A22,Calendar!$A$3:$G$459,4,FALSE)))),\"\",IF(Summary!$B$5=3,IF(VLOOKUP(A22,Calendar!$A$3:$G$459,7,FALSE)=\"S\", \"\", VLOOKUP(A22,Calendar!$A$3:$G$459,7,FALSE)),IF(VLOOKUP(A22,Calendar!$A$3:$G$459,4,FALSE)=\"S\", \"\", VLOOKUP(A22,Calendar!$A$3:$G$459,4,FALSE))))","v":""},{"$f":"IF(Summary!$B$5=3,IF(C22=\"\",\"\",VLOOKUP(A22,Calendar!$A$3:$G$459,5,FALSE)),IF(C22=\"\",\"\",VLOOKUP(A22,Calendar!$A$3:$G$459,2,FALSE)))","v":""},null,null,null,null,0,null,null,""]
[315,null,{"$f":"IF(ISNA(IF(Summary!$B$5=3,IF(VLOOKUP(A23,Calendar!$A$3:$G$459,7,FALSE)=\"S\", \"\", VLOOKUP(A23,Calendar!$A$3:$G$459,7,FALSE)),IF(VLOOKUP(A23,Calendar!$A$3:$G$459,4,FALSE)=\"S\", \"\", VLOOKUP(A23,Calendar!$A$3:$G$459,4,FALSE)))),\"\",IF(Summary!$B$5=3,IF(VLOOKUP(A23,Calendar!$A$3:$G$459,7,FALSE)=\"S\", \"\", VLOOKUP(A23,Calendar!$A$3:$G$459,7,FALSE)),IF(VLOOKUP(A23,Calendar!$A$3:$G$459,4,FALSE)=\"S\", \"\", VLOOKUP(A23,Calendar!$A$3:$G$459,4,FALSE))))","v":""},{"$f":"IF(Summary!$B$5=3,IF(C23=\"\",\"\",VLOOKUP(A23,Calendar!$A$3:$G$459,5,FALSE)),IF(C23=\"\",\"\",VLOOKUP(A23,Calendar!$A$3:$G$459,2,FALSE)))","v":""},null,null,null,null,0,null,null,""]
[316,null,{"$f":"IF(ISNA(IF(Summary!$B$5=3,IF(VLOOKUP(A24,Calendar!$A$3:$G$459,7,FALSE)=\"S\", \"\", VLOOKUP(A24,Calendar!$A$3:$G$459,7,FALSE)),IF(VLOOKUP(A24,Calendar!$A$3:$G$459,4,FALSE)=\"S\", \"\", VLOOKUP(A24,Calendar!$A$3:$G$459,4,FALSE)))),\"\",IF(Summary!$B$5=3,IF(VLOOKUP(A24,Calendar!$A$3:$G$459,7,FALSE)=\"S\", \"\", VLOOKUP(A24,Calendar!$A$3:$G$459,7,FALSE)),IF(VLOOKUP(A24,Calendar!$A$3:$G$459,4,FALSE)=\"S\", \"\", VLOOKUP(A24,Calendar!$A$3:$G$459,4,FALSE))))","v":"M"},{"$f":"IF(Summary!$B$5=3,IF(C24=\"\",\"\",VLOOKUP(A24,Calendar!$A$3:$G$459,5,FALSE)),IF(C24=\"\",\"\",VLOOKUP(A24,Calendar!$A$3:$G$459,2,FALSE)))","v":"2020-03-16"},null,null,null,null,0,null,null,""]
[317,null,{"$f":"IF(ISNA(IF(Summary!$B$5=3,IF(VLOOKUP(A25,Calendar!$A$3:$G$459,7,FALSE)=\"S\", \"\", VLOOKUP(A25,Calendar!$A$3:$G$459,7,FALSE)),IF(VLOOKUP(A25,Calendar!$A$3:$G$459,4,FALSE)=\"S\", \"\", VLOOKUP(A25,Calendar!$A$3:$G$459,4,FALSE)))),\"\",IF(Summary!$B$5=3,IF(VLOOKUP(A25,Calendar!$A$3:$G$459,7,FALSE)=\"S\", \"\", VLOOKUP(A25,Calendar!$A$3:$G$459,7,FALSE)),IF(VLOOKUP(A25,Calendar!$A$3:$G$459,4,FALSE)=\"S\", \"\", VLOOKUP(A25,Calendar!$A$3:$G$459,4,FALSE))))","v":"T"},{"$f":"IF(Summary!$B$5=3,IF(C25=\"\",\"\",VLOOKUP(A25,Calendar!$A$3:$G$459,5,FALSE)),IF(C25=\"\",\"\",VLOOKUP(A25,Calendar!$A$3:$G$459,2,FALSE)))","v":"2020-03-17"},null,null,null,null,0,null,null,""]
[318,null,{"$f":"IF(ISNA(IF(Summary!$B$5=3,IF(VLOOKUP(A26,Calendar!$A$3:$G$459,7,FALSE)=\"S\", \"\", VLOOKUP(A26,Calendar!$A$3:$G$459,7,FALSE)),IF(VLOOKUP(A26,Calendar!$A$3:$G$459,4,FALSE)=\"S\", \"\", VLOOKUP(A26,Calendar!$A$3:$G$459,4,FALSE)))),\"\",IF(Summary!$B$5=3,IF(VLOOKUP(A26,Calendar!$A$3:$G$459,7,FALSE)=\"S\", \"\", VLOOKUP(A26,Calendar!$A$3:$G$459,7,FALSE)),IF(VLOOKUP(A26,Calendar!$A$3:$G$459,4,FALSE)=\"S\", \"\", VLOOKUP(A26,Calendar!$A$3:$G$459,4,FALSE))))","v":"W"},{"$f":"IF(Summary!$B$5=3,IF(C26=\"\",\"\",VLOOKUP(A26,Calendar!$A$3:$G$459,5,FALSE)),IF(C26=\"\",\"\",VLOOKUP(A26,Calendar!$A$3:$G$459,2,FALSE)))","v":"2020-03-18"},null,null,null,null,0,null,null,""]
[319,null,{"$f":"IF(ISNA(IF(Summary!$B$5=3,IF(VLOOKUP(A27,Calendar!$A$3:$G$459,7,FALSE)=\"S\", \"\", VLOOKUP(A27,Calendar!$A$3:$G$459,7,FALSE)),IF(VLOOKUP(A27,Calendar!$A$3:$G$459,4,FALSE)=\"S\", \"\", VLOOKUP(A27,Calendar!$A$3:$G$459,4,FALSE)))),\"\",IF(Summary!$B$5=3,IF(VLOOKUP(A27,Calendar!$A$3:$G$459,7,FALSE)=\"S\", \"\", VLOOKUP(A27,Calendar!$A$3:$G$459,7,FALSE)),IF(VLOOKUP(A27,Calendar!$A$3:$G$459,4,FALSE)=\"S\", \"\", VLOOKUP(A27,Calendar!$A$3:$G$459,4,FALSE))))","v":"R"},{"$f":"IF(Summary!$B$5=3,IF(C27=\"\",\"\",VLOOKUP(A27,Calendar!$A$3:$G$459,5,FALSE)),IF(C27=\"\",\"\",VLOOKUP(A27,Calendar!$A$3:$G$459,2,FALSE)))","v":"2020-03-19"},null,null,null,null,0,null,null,""]
[320,null,{"$f":"IF(ISNA(IF(Summary!$B$5=3,IF(VLOOKUP(A28,Calendar!$A$3:$G$459,7,FALSE)=\"S\", \"\", VLOOKUP(A28,Calendar!$A$3:$G$459,7,FALSE)),IF(VLOOKUP(A28,Calendar!$A$3:$G$459,4,FALSE)=\"S\", \"\", VLOOKUP(A28,Calendar!$A$3:$G$459,4,FALSE)))),\"\",IF(Summary!$B$5=3,IF(VLOOKUP(A28,Calendar!$A$3:$G$459,7,FALSE)=\"S\", \"\", VLOOKUP(A28,Calendar!$A$3:$G$459,7,FALSE)),IF(VLOOKUP(A28,Calendar!$A$3:$G$459,4,FALSE)=\"S\", \"\", VLOOKUP(A28,Calendar!$A$3:$G$459,4,FALSE))))","v":"F"},{"$f":"IF(Summary!$B$5=3,IF(C28=\"\",\"\",VLOOKUP(A28,Calendar!$A$3:$G$459,5,FALSE)),IF(C28=\"\",\"\",VLOOKUP(A28,Calendar!$A$3:$G$459,2,FALSE)))","v":"2020-03-20"},null,null,null,null,0,null,null,""]
[321,null,{"$f":"IF(ISNA(IF(Summary!$B$5=3,IF(VLOOKUP(A29,Calendar!$A$3:$G$459,7,FALSE)=\"S\", \"\", VLOOKUP(A29,Calendar!$A$3:$G$459,7,FALSE)),IF(VLOOKUP(A29,Calendar!$A$3:$G$459,4,FALSE)=\"S\", \"\", VLOOKUP(A29,Calendar!$A$3:$G$459,4,FALSE)))),\"\",IF(Summary!$B$5=3,IF(VLOOKUP(A29,Calendar!$A$3:$G$459,7,FALSE)=\"S\", \"\", VLOOKUP(A29,Calendar!$A$3:$G$459,7,FALSE)),IF(VLOOKUP(A29,Calendar!$A$3:$G$459,4,FALSE)=\"S\", \"\", VLOOKUP(A29,Calendar!$A$3:$G$459,4,FALSE))))","v":""},{"$f":"IF(Summary!$B$5=3,IF(C29=\"\",\"\",VLOOKUP(A29,Calendar!$A$3:$G$459,5,FALSE)),IF(C29=\"\",\"\",VLOOKUP(A29,Calendar!$A$3:$G$459,2,FALSE)))","v":""},null,null,null,null,0,null,null,""]
[322,null,{"$f":"IF(ISNA(IF(Summary!$B$5=3,IF(VLOOKUP(A30,Calendar!$A$3:$G$459,7,FALSE)=\"S\", \"\", VLOOKUP(A30,Calendar!$A$3:$G$459,7,FALSE)),IF(VLOOKUP(A30,Calendar!$A$3:$G$459,4,FALSE)=\"S\", \"\", VLOOKUP(A30,Calendar!$A$3:$G$459,4,FALSE)))),\"\",IF(Summary!$B$5=3,IF(VLOOKUP(A30,Calendar!$A$3:$G$459,7,FALSE)=\"S\", \"\", VLOOKUP(A30,Calendar!$A$3:$G$459,7,FALSE)),IF(VLOOKUP(A30,Calendar!$A$3:$G$459,4,FALSE)=\"S\", \"\", VLOOKUP(A30,Calendar!$A$3:$G$459,4,FALSE))))","v":""},{"$f":"IF(Summary!$B$5=3,IF(C30=\"\",\"\",VLOOKUP(A30,Calendar!$A$3:$G$459,5,FALSE)),IF(C30=\"\",\"\",VLOOKUP(A30,Calendar!$A$3:$G$459,2,FALSE)))","v":""},null,null,null,null,0,null,null,""]
[323,null,{"$f":"IF(ISNA(IF(Summary!$B$5=3,IF(VLOOKUP(A31,Calendar!$A$3:$G$459,7,FALSE)=\"S\", \"\", VLOOKUP(A31,Calendar!$A$3:$G$459,7,FALSE)),IF(VLOOKUP(A31,Calendar!$A$3:$G$459,4,FALSE)=\"S\", \"\", VLOOKUP(A31,Calendar!$A$3:$G$459,4,FALSE)))),\"\",IF(Summary!$B$5=3,IF(VLOOKUP(A31,Calendar!$A$3:$G$459,7,FALSE)=\"S\", \"\", VLOOKUP(A31,Calendar!$A$3:$G$459,7,FALSE)),IF(VLOOKUP(A31,Calendar!$A$3:$G$459,4,FALSE)=\"S\", \"\", VLOOKUP(A31,Calendar!$A$3:$G$459,4,FALSE))))","v":"M"},{"$f":"IF(Summary!$B$5=3,IF(C31=\"\",\"\",VLOOKUP(A31,Calendar!$A$3:$G$459,5,FALSE)),IF(C31=\"\",\"\",VLOOKUP(A31,Calendar!$A$3:$G$459,2,FALSE)))","v":"2020-03-23"},null,null,null,null,0,null,null,""]
[324,null,{"$f":"IF(ISNA(IF(Summary!$B$5=3,IF(VLOOKUP(A32,Calendar!$A$3:$G$459,7,FALSE)=\"S\", \"\", VLOOKUP(A32,Calendar!$A$3:$G$459,7,FALSE)),IF(VLOOKUP(A32,Calendar!$A$3:$G$459,4,FALSE)=\"S\", \"\", VLOOKUP(A32,Calendar!$A$3:$G$459,4,FALSE)))),\"\",IF(Summary!$B$5=3,IF(VLOOKUP(A32,Calendar!$A$3:$G$459,7,FALSE)=\"S\", \"\", VLOOKUP(A32,Calendar!$A$3:$G$459,7,FALSE)),IF(VLOOKUP(A32,Calendar!$A$3:$G$459,4,FALSE)=\"S\", \"\", VLOOKUP(A32,Calendar!$A$3:$G$459,4,FALSE))))","v":"T"},{"$f":"IF(Summary!$B$5=3,IF(C32=\"\",\"\",VLOOKUP(A32,Calendar!$A$3:$G$459,5,FALSE)),IF(C32=\"\",\"\",VLOOKUP(A32,Calendar!$A$3:$G$459,2,FALSE)))","v":"2020-03-24"},null,null,null,null,0,null,null,""]
[325,null,{"$f":"IF(ISNA(IF(Summary!$B$5=3,IF(VLOOKUP(A33,Calendar!$A$3:$G$459,7,FALSE)=\"S\", \"\", VLOOKUP(A33,Calendar!$A$3:$G$459,7,FALSE)),IF(VLOOKUP(A33,Calendar!$A$3:$G$459,4,FALSE)=\"S\", \"\", VLOOKUP(A33,Calendar!$A$3:$G$459,4,FALSE)))),\"\",IF(Summary!$B$5=3,IF(VLOOKUP(A33,Calendar!$A$3:$G$459,7,FALSE)=\"S\", \"\", VLOOKUP(A33,Calendar!$A$3:$G$459,7,FALSE)),IF(VLOOKUP(A33,Calendar!$A$3:$G$459,4,FALSE)=\"S\", \"\", VLOOKUP(A33,Calendar!$A$3:$G$459,4,FALSE))))","v":"W"},{"$f":"IF(Summary!$B$5=3,IF(C33=\"\",\"\",VLOOKUP(A33,Calendar!$A$3:$G$459,5,FALSE)),IF(C33=\"\",\"\",VLOOKUP(A33,Calendar!$A$3:$G$459,2,FALSE)))","v":"2020-03-25"},null,null,null,null,0,null,null,""]
[326,null,{"$f":"IF(ISNA(IF(Summary!$B$5=3,IF(VLOOKUP(A34,Calendar!$A$3:$G$459,7,FALSE)=\"S\", \"\", VLOOKUP(A34,Calendar!$A$3:$G$459,7,FALSE)),IF(VLOOKUP(A34,Calendar!$A$3:$G$459,4,FALSE)=\"S\", \"\", VLOOKUP(A34,Calendar!$A$3:$G$459,4,FALSE)))),\"\",IF(Summary!$B$5=3,IF(VLOOKUP(A34,Calendar!$A$3:$G$459,7,FALSE)=\"S\", \"\", VLOOKUP(A34,Calendar!$A$3:$G$459,7,FALSE)),IF(VLOOKUP(A34,Calendar!$A$3:$G$459,4,FALSE)=\"S\", \"\", VLOOKUP(A34,Calendar!$A$3:$G$459,4,FALSE))))","v":"R"},{"$f":"IF(Summary!$B$5=3,IF(C34=\"\",\"\",VLOOKUP(A34,Calendar!$A$3:$G$459,5,FALSE)),IF(C34=\"\",\"\",VLOOKUP(A34,Calendar!$A$3:$G$459,2,FALSE)))","v":"2020-03-26"},null,null,null,null,0,null,null,""]
[327,null,{"$f":"IF(ISNA(IF(Summary!$B$5=3,IF(VLOOKUP(A35,Calendar!$A$3:$G$459,7,FALSE)=\"S\", \"\", VLOOKUP(A35,Calendar!$A$3:$G$459,7,FALSE)),IF(VLOOKUP(A35,Calendar!$A$3:$G$459,4,FALSE)=\"S\", \"\", VLOOKUP(A35,Calendar!$A$3:$G$459,4,FALSE)))),\"\",IF(Summary!$B$5=3,IF(VLOOKUP(A35,Calendar!$A$3:$G$459,7,FALSE)=\"S\", \"\", VLOOKUP(A35,Calendar!$A$3:$G$459,7,FALSE)),IF(VLOOKUP(A35,Calendar!$A$3:$G$459,4,FALSE)=\"S\", \"\", VLOOKUP(A35,Calendar!$A$3:$G$459,4,FALSE))))","v":"F"},{"$f":"IF(Summary!$B$5=3,IF(C35=\"\",\"\",VLOOKUP(A35,Calendar!$A$3:$G$459,5,FALSE)),IF(C35=\"\",\"\",VLOOKUP(A35,Calendar!$A$3:$G$459,2,FALSE)))","v":"2020-03-27"},null,null,null,null,0,null,null,""]
[328,null,{"$f":"IF(ISNA(IF(Summary!$B$5=3,IF(VLOOKUP(A36,Calendar!$A$3:$G$459,7,FALSE)=\"S\", \"\", VLOOKUP(A36,Calendar!$A$3:$G$459,7,FALSE)),IF(VLOOKUP(A36,Calendar!$A$3:$G$459,4,FALSE)=\"S\", \"\", VLOOKUP(A36,Calendar!$A$3:$G$459,4,FALSE)))),\"\",IF(Summary!$B$5=3,IF(VLOOKUP(A36,Calendar!$A$3:$G$459,7,FALSE)=\"S\", \"\", VLOOKUP(A36,Calendar!$A$3:$G$459,7,FALSE)),IF(VLOOKUP(A36,Calendar!$A$3:$G$459,4,FALSE)=\"S\", \"\", VLOOKUP(A36,Calendar!$A$3:$G$459,4,FALSE))))","v":""},{"$f":"IF(Summary!$B$5=3,IF(C36=\"\",\"\",VLOOKUP(A36,Calendar!$A$3:$G$459,5,FALSE)),IF(C36=\"\",\"\",VLOOKUP(A36,Calendar!$A$3:$G$459,2,FALSE)))","v":""},null,null,null,null,0,null,null,""]
[329,null,{"$f":"IF(ISNA(IF(Summary!$B$5=3,IF(VLOOKUP(A37,Calendar!$A$3:$G$459,7,FALSE)=\"S\", \"\", VLOOKUP(A37,Calendar!$A$3:$G$459,7,FALSE)),IF(VLOOKUP(A37,Calendar!$A$3:$G$459,4,FALSE)=\"S\", \"\", VLOOKUP(A37,Calendar!$A$3:$G$459,4,FALSE)))),\"\",IF(Summary!$B$5=3,IF(VLOOKUP(A37,Calendar!$A$3:$G$459,7,FALSE)=\"S\", \"\", VLOOKUP(A37,Calendar!$A$3:$G$459,7,FALSE)),IF(VLOOKUP(A37,Calendar!$A$3:$G$459,4,FALSE)=\"S\", \"\", VLOOKUP(A37,Calendar!$A$3:$G$459,4,FALSE))))","v":""},{"$f":"IF(Summary!$B$5=3,IF(C37=\"\",\"\",VLOOKUP(A37,Calendar!$A$3:$G$459,5,FALSE)),IF(C37=\"\",\"\",VLOOKUP(A37,Calendar!$A$3:$G$459,2,FALSE)))","v":""},null,null,null,null,0,null,null,""]
[330,null,{"$f":"IF(ISNA(IF(Summary!$B$5=3,IF(VLOOKUP(A38,Calendar!$A$3:$G$459,7,FALSE)=\"S\", \"\", VLOOKUP(A38,Calendar!$A$3:$G$459,7,FALSE)),IF(VLOOKUP(A38,Calendar!$A$3:$G$459,4,FALSE)=\"S\", \"\", VLOOKUP(A38,Calendar!$A$3:$G$459,4,FALSE)))),\"\",IF(Summary!$B$5=3,IF(VLOOKUP(A38,Calendar!$A$3:$G$459,7,FALSE)=\"S\", \"\", VLOOKUP(A38,Calendar!$A$3:$G$459,7,FALSE)),IF(VLOOKUP(A38,Calendar!$A$3:$G$459,4,FALSE)=\"S\", \"\", VLOOKUP(A38,Calendar!$A$3:$G$459,4,FALSE))))","v":"M"},{"$f":"IF(Summary!$B$5=3,IF(C38=\"\",\"\",VLOOKUP(A38,Calendar!$A$3:$G$459,5,FALSE)),IF(C38=\"\",\"\",VLOOKUP(A38,Calendar!$A$3:$G$459,2,FALSE)))","v":"2020-03-30"},null,null,null,null,0,null,null,""]
[331,null,{"$f":"IF(ISNA(IF(Summary!$B$5=3,IF(VLOOKUP(A39,Calendar!$A$3:$G$459,7,FALSE)=\"S\", \"\", VLOOKUP(A39,Calendar!$A$3:$G$459,7,FALSE)),IF(VLOOKUP(A39,Calendar!$A$3:$G$459,4,FALSE)=\"S\", \"\", VLOOKUP(A39,Calendar!$A$3:$G$459,4,FALSE)))),\"\",IF(Summary!$B$5=3,IF(VLOOKUP(A39,Calendar!$A$3:$G$459,7,FALSE)=\"S\", \"\", VLOOKUP(A39,Calendar!$A$3:$G$459,7,FALSE)),IF(VLOOKUP(A39,Calendar!$A$3:$G$459,4,FALSE)=\"S\", \"\", VLOOKUP(A39,Calendar!$A$3:$G$459,4,FALSE))))","v":"T"},{"$f":"IF(Summary!$B$5=3,IF(C39=\"\",\"\",VLOOKUP(A39,Calendar!$A$3:$G$459,5,FALSE)),IF(C39=\"\",\"\",VLOOKUP(A39,Calendar!$A$3:$G$459,2,FALSE)))","v":"2020-03-31"},null,null,null,null,0,null,null,""]
[null,null,null,"Total Minutes",{"$f":"SUM(E9:E39)","v":0},{"$f":"SUM(F9:F39)","v":0},0,0,0,null,null,{"$f":"IF(SUM(E40:H40)>COUNTA(E9:E39)*390,\"The sum total for all cost objectives exceeds the maximum anticipated value based upon the number of days worked. Confirm minutes claimed for each day.\",\"\")","v":""}]
[null,null,null,"Total Hours",{"$f":"E40/60","v":0},{"$f":"F40/60","v":0},0,0,0]
[]
[]
[null,null,"Notes"]
[]
[]
[]
[]
[]
[]
[]
[]
[]
[]
[]
[null,null,null,null,"Kansas State Department of Education",null,null,null,"Personnel Activity Report"]
[null,null,null,null,"Fiscal Auditing",null,null,null,"Updated 9/20/18"]
[null,null,null,null,"785-296-4976"]
[null,null,null,null,"https://www.ksde.org/Agency/Fiscal-and-Administrative-Services/Fiscal-Auditing"]
[]
[]
[null,null,"The Kansas State Department of Education does not discriminate on the basis of race, color, national origin, sex, disability, or age in its programs and activities and provides equal access to the Boy Scouts and other designated youth groups. The following person has been designated to handle inquiries regarding the nondiscrimination policies: KSDE General Counsel, Office of General Counsel, KSDE, Landon State Office Building, 900 S.W. Jackson, Suite 102, Topeka, KS 66612, (785) 296-3204."]

{"sheet":"April","index":11,"n_rows":62,"n_cols":12,"rows_kept":62,"cut":false,"hidden":false,"merged":[[61,2,62,8],[1,2,1,8],[2,2,2,8],[3,2,3,8],[4,2,4,8],[46,2,46,8],[47,2,47,8],[48,2,48,8],[49,2,49,8],[5,2,5,8],[6,2,6,8],[43,3,43,8],[44,2,44,8],[45,2,45,8]]}
[]
[]
[null,null,"Personnel Activity Report"]
[null,null,"Regular School Year"]
[null,null,"April"]
[null,null,{"$f":"IF(Summary!$E$8<>\"\",Summary!$E$8,\" \")","v":" "}]
[null,null,{"$f":"IF(Summary!$E$9<>\"\",Summary!$E$9,\" \")","v":" "}]
[null,null,"Day","Date","Special Ed","General Ed","Other","Other","Totals",null,null,{"$f":"IF(OR(AND(F8=\"\",COUNTA(F9:F39)>0),AND(G8=\"\",COUNTA(G9:G39)>0),AND(H8=\"\",COUNTA(H9:H39)>0)),\"<<< You must identify the cost objective in the column heading.\",\"\")","v":""}]
[401,null,{"$f":"IF(ISNA(IF(Summary!$B$5=3,IF(VLOOKUP(A9,Calendar!$A$3:$G$459,7,FALSE)=\"S\", \"\", VLOOKUP(A9,Calendar!$A$3:$G$459,7,FALSE)),IF(VLOOKUP(A9,Calendar!$A$3:$G$459,4,FALSE)=\"S\", \"\", VLOOKUP(A9,Calendar!$A$3:$G$459,4,FALSE)))),\"\",IF(Summary!$B$5=3,IF(VLOOKUP(A9,Calendar!$A$3:$G$459,7,FALSE)=\"S\", \"\", VLOOKUP(A9,Calendar!$A$3:$G$459,7,FALSE)),IF(VLOOKUP(A9,Calendar!$A$3:$G$459,4,FALSE)=\"S\", \"\", VLOOKUP(A9,Calendar!$A$3:$G$459,4,FALSE))))","v":"W"},{"$f":"IF(Summary!$B$5=3,IF(C9=\"\",\"\",VLOOKUP(A9,Calendar!$A$3:$G$459,5,FALSE)),IF(C9=\"\",\"\",VLOOKUP(A9,Calendar!$A$3:$G$459,2,FALSE)))","v":"2020-04-01"},null,null,null,null,{"$f":"MIN(1440,SUM(E9:H9))","v":0},null,null,{"$f":"IF(I9>390, \"<<< Day exceeds 390 minutes. Confirm reported time.\",\"\")","v":""}]
[402,null,{"$f":"IF(ISNA(IF(Summary!$B$5=3,IF(VLOOKUP(A10,Calendar!$A$3:$G$459,7,FALSE)=\"S\", \"\", VLOOKUP(A10,Calendar!$A$3:$G$459,7,FALSE)),IF(VLOOKUP(A10,Calendar!$A$3:$G$459,4,FALSE)=\"S\", \"\", VLOOKUP(A10,Calendar!$A$3:$G$459,4,FALSE)))),\"\",IF(Summary!$B$5=3,IF(VLOOKUP(A10,Calendar!$A$3:$G$459,7,FALSE)=\"S\", \"\", VLOOKUP(A10,Calendar!$A$3:$G$459,7,FALSE)),IF(VLOOKUP(A10,Calendar!$A$3:$G$459,4,FALSE)=\"S\", \"\", VLOOKUP(A10,Calendar!$A$3:$G$459,4,FALSE))))","v":"R"},{"$f":"IF(Summary!$B$5=3,IF(C10=\"\",\"\",VLOOKUP(A10,Calendar!$A$3:$G$459,5,FALSE)),IF(C10=\"\",\"\",VLOOKUP(A10,Calendar!$A$3:$G$459,2,FALSE)))","v":"2020-04-02"},null,null,null,null,{"$f":"MIN(1440,SUM(E10:H10))","v":0},null,null,{"$f":"IF(I10>390, \"<<< Day exceeds 390 minutes. Confirm reported time.\",\"\")","v":""}]
[403,null,{"$f":"IF(ISNA(IF(Summary!$B$5=3,IF(VLOOKUP(A11,Calendar!$A$3:$G$459,7,FALSE)=\"S\", \"\", VLOOKUP(A11,Calendar!$A$3:$G$459,7,FALSE)),IF(VLOOKUP(A11,Calendar!$A$3:$G$459,4,FALSE)=\"S\", \"\", VLOOKUP(A11,Calendar!$A$3:$G$459,4,FALSE)))),\"\",IF(Summary!$B$5=3,IF(VLOOKUP(A11,Calendar!$A$3:$G$459,7,FALSE)=\"S\", \"\", VLOOKUP(A11,Calendar!$A$3:$G$459,7,FALSE)),IF(VLOOKUP(A11,Calendar!$A$3:$G$459,4,FALSE)=\"S\", \"\", VLOOKUP(A11,Calendar!$A$3:$G$459,4,FALSE))))","v":"F"},{"$f":"IF(Summary!$B$5=3,IF(C11=\"\",\"\",VLOOKUP(A11,Calendar!$A$3:$G$459,5,FALSE)),IF(C11=\"\",\"\",VLOOKUP(A11,Calendar!$A$3:$G$459,2,FALSE)))","v":"2020-04-03"},null,null,null,null,0,null,null,""]
[404,null,{"$f":"IF(ISNA(IF(Summary!$B$5=3,IF(VLOOKUP(A12,Calendar!$A$3:$G$459,7,FALSE)=\"S\", \"\", VLOOKUP(A12,Calendar!$A$3:$G$459,7,FALSE)),IF(VLOOKUP(A12,Calendar!$A$3:$G$459,4,FALSE)=\"S\", \"\", VLOOKUP(A12,Calendar!$A$3:$G$459,4,FALSE)))),\"\",IF(Summary!$B$5=3,IF(VLOOKUP(A12,Calendar!$A$3:$G$459,7,FALSE)=\"S\", \"\", VLOOKUP(A12,Calendar!$A$3:$G$459,7,FALSE)),IF(VLOOKUP(A12,Calendar!$A$3:$G$459,4,FALSE)=\"S\", \"\", VLOOKUP(A12,Calendar!$A$3:$G$459,4,FALSE))))","v":""},{"$f":"IF(Summary!$B$5=3,IF(C12=\"\",\"\",VLOOKUP(A12,Calendar!$A$3:$G$459,5,FALSE)),IF(C12=\"\",\"\",VLOOKUP(A12,Calendar!$A$3:$G$459,2,FALSE)))","v":""},null,null,null,null,0,null,null,""]
[405,null,{"$f":"IF(ISNA(IF(Summary!$B$5=3,IF(VLOOKUP(A13,Calendar!$A$3:$G$459,7,FALSE)=\"S\", \"\", VLOOKUP(A13,Calendar!$A$3:$G$459,7,FALSE)),IF(VLOOKUP(A13,Calendar!$A$3:$G$459,4,FALSE)=\"S\", \"\", VLOOKUP(A13,Calendar!$A$3:$G$459,4,FALSE)))),\"\",IF(Summary!$B$5=3,IF(VLOOKUP(A13,Calendar!$A$3:$G$459,7,FALSE)=\"S\", \"\", VLOOKUP(A13,Calendar!$A$3:$G$459,7,FALSE)),IF(VLOOKUP(A13,Calendar!$A$3:$G$459,4,FALSE)=\"S\", \"\", VLOOKUP(A13,Calendar!$A$3:$G$459,4,FALSE))))","v":""},{"$f":"IF(Summary!$B$5=3,IF(C13=\"\",\"\",VLOOKUP(A13,Calendar!$A$3:$G$459,5,FALSE)),IF(C13=\"\",\"\",VLOOKUP(A13,Calendar!$A$3:$G$459,2,FALSE)))","v":""},null,null,null,null,0,null,null,""]
[406,null,{"$f":"IF(ISNA(IF(Summary!$B$5=3,IF(VLOOKUP(A14,Calendar!$A$3:$G$459,7,FALSE)=\"S\", \"\", VLOOKUP(A14,Calendar!$A$3:$G$459,7,FALSE)),IF(VLOOKUP(A14,Calendar!$A$3:$G$459,4,FALSE)=\"S\", \"\", VLOOKUP(A14,Calendar!$A$3:$G$459,4,FALSE)))),\"\",IF(Summary!$B$5=3,IF(VLOOKUP(A14,Calendar!$A$3:$G$459,7,FALSE)=\"S\", \"\", VLOOKUP(A14,Calendar!$A$3:$G$459,7,FALSE)),IF(VLOOKUP(A14,Calendar!$A$3:$G$459,4,FALSE)=\"S\", \"\", VLOOKUP(A14,Calendar!$A$3:$G$459,4,FALSE))))","v":"M"},{"$f":"IF(Summary!$B$5=3,IF(C14=\"\",\"\",VLOOKUP(A14,Calendar!$A$3:$G$459,5,FALSE)),IF(C14=\"\",\"\",VLOOKUP(A14,Calendar!$A$3:$G$459,2,FALSE)))","v":"2020-04-06"},null,null,null,null,0,null,null,""]
[407,null,{"$f":"IF(ISNA(IF(Summary!$B$5=3,IF(VLOOKUP(A15,Calendar!$A$3:$G$459,7,FALSE)=\"S\", \"\", VLOOKUP(A15,Calendar!$A$3:$G$459,7,FALSE)),IF(VLOOKUP(A15,Calendar!$A$3:$G$459,4,FALSE)=\"S\", \"\", VLOOKUP(A15,Calendar!$A$3:$G$459,4,FALSE)))),\"\",IF(Summary!$B$5=3,IF(VLOOKUP(A15,Calendar!$A$3:$G$459,7,FALSE)=\"S\", \"\", VLOOKUP(A15,Calendar!$A$3:$G$459,7,FALSE)),IF(VLOOKUP(A15,Calendar!$A$3:$G$459,4,FALSE)=\"S\", \"\", VLOOKUP(A15,Calendar!$A$3:$G$459,4,FALSE))))","v":"T"},{"$f":"IF(Summary!$B$5=3,IF(C15=\"\",\"\",VLOOKUP(A15,Calendar!$A$3:$G$459,5,FALSE)),IF(C15=\"\",\"\",VLOOKUP(A15,Calendar!$A$3:$G$459,2,FALSE)))","v":"2020-04-07"},null,null,null,null,0,null,null,""]
[408,null,{"$f":"IF(ISNA(IF(Summary!$B$5=3,IF(VLOOKUP(A16,Calendar!$A$3:$G$459,7,FALSE)=\"S\", \"\", VLOOKUP(A16,Calendar!$A$3:$G$459,7,FALSE)),IF(VLOOKUP(A16,Calendar!$A$3:$G$459,4,FALSE)=\"S\", \"\", VLOOKUP(A16,Calendar!$A$3:$G$459,4,FALSE)))),\"\",IF(Summary!$B$5=3,IF(VLOOKUP(A16,Calendar!$A$3:$G$459,7,FALSE)=\"S\", \"\", VLOOKUP(A16,Calendar!$A$3:$G$459,7,FALSE)),IF(VLOOKUP(A16,Calendar!$A$3:$G$459,4,FALSE)=\"S\", \"\", VLOOKUP(A16,Calendar!$A$3:$G$459,4,FALSE))))","v":"W"},{"$f":"IF(Summary!$B$5=3,IF(C16=\"\",\"\",VLOOKUP(A16,Calendar!$A$3:$G$459,5,FALSE)),IF(C16=\"\",\"\",VLOOKUP(A16,Calendar!$A$3:$G$459,2,FALSE)))","v":"2020-04-08"},null,null,null,null,0,null,null,""]
[409,null,{"$f":"IF(ISNA(IF(Summary!$B$5=3,IF(VLOOKUP(A17,Calendar!$A$3:$G$459,7,FALSE)=\"S\", \"\", VLOOKUP(A17,Calendar!$A$3:$G$459,7,FALSE)),IF(VLOOKUP(A17,Calendar!$A$3:$G$459,4,FALSE)=\"S\", \"\", VLOOKUP(A17,Calendar!$A$3:$G$459,4,FALSE)))),\"\",IF(Summary!$B$5=3,IF(VLOOKUP(A17,Calendar!$A$3:$G$459,7,FALSE)=\"S\", \"\", VLOOKUP(A17,Calendar!$A$3:$G$459,7,FALSE)),IF(VLOOKUP(A17,Calendar!$A$3:$G$459,4,FALSE)=\"S\", \"\", VLOOKUP(A17,Calendar!$A$3:$G$459,4,FALSE))))","v":"R"},{"$f":"IF(Summary!$B$5=3,IF(C17=\"\",\"\",VLOOKUP(A17,Calendar!$A$3:$G$459,5,FALSE)),IF(C17=\"\",\"\",VLOOKUP(A17,Calendar!$A$3:$G$459,2,FALSE)))","v":"2020-04-09"},null,null,null,null,0,null,null,""]
[410,null,{"$f":"IF(ISNA(IF(Summary!$B$5=3,IF(VLOOKUP(A18,Calendar!$A$3:$G$459,7,FALSE)=\"S\", \"\", VLOOKUP(A18,Calendar!$A$3:$G$459,7,FALSE)),IF(VLOOKUP(A18,Calendar!$A$3:$G$459,4,FALSE)=\"S\", \"\", VLOOKUP(A18,Calendar!$A$3:$G$459,4,FALSE)))),\"\",IF(Summary!$B$5=3,IF(VLOOKUP(A18,Calendar!$A$3:$G$459,7,FALSE)=\"S\", \"\", VLOOKUP(A18,Calendar!$A$3:$G$459,7,FALSE)),IF(VLOOKUP(A18,Calendar!$A$3:$G$459,4,FALSE)=\"S\", \"\", VLOOKUP(A18,Calendar!$A$3:$G$459,4,FALSE))))","v":"F"},{"$f":"IF(Summary!$B$5=3,IF(C18=\"\",\"\",VLOOKUP(A18,Calendar!$A$3:$G$459,5,FALSE)),IF(C18=\"\",\"\",VLOOKUP(A18,Calendar!$A$3:$G$459,2,FALSE)))","v":"2020-04-10"},null,null,null,null,0,null,null,""]
[411,null,{"$f":"IF(ISNA(IF(Summary!$B$5=3,IF(VLOOKUP(A19,Calendar!$A$3:$G$459,7,FALSE)=\"S\", \"\", VLOOKUP(A19,Calendar!$A$3:$G$459,7,FALSE)),IF(VLOOKUP(A19,Calendar!$A$3:$G$459,4,FALSE)=\"S\", \"\", VLOOKUP(A19,Calendar!$A$3:$G$459,4,FALSE)))),\"\",IF(Summary!$B$5=3,IF(VLOOKUP(A19,Calendar!$A$3:$G$459,7,FALSE)=\"S\", \"\", VLOOKUP(A19,Calendar!$A$3:$G$459,7,FALSE)),IF(VLOOKUP(A19,Calendar!$A$3:$G$459,4,FALSE)=\"S\", \"\", VLOOKUP(A19,Calendar!$A$3:$G$459,4,FALSE))))","v":""},{"$f":"IF(Summary!$B$5=3,IF(C19=\"\",\"\",VLOOKUP(A19,Calendar!$A$3:$G$459,5,FALSE)),IF(C19=\"\",\"\",VLOOKUP(A19,Calendar!$A$3:$G$459,2,FALSE)))","v":""},null,null,null,null,0,null,null,""]
[412,null,{"$f":"IF(ISNA(IF(Summary!$B$5=3,IF(VLOOKUP(A20,Calendar!$A$3:$G$459,7,FALSE)=\"S\", \"\", VLOOKUP(A20,Calendar!$A$3:$G$459,7,FALSE)),IF(VLOOKUP(A20,Calendar!$A$3:$G$459,4,FALSE)=\"S\", \"\", VLOOKUP(A20,Calendar!$A$3:$G$459,4,FALSE)))),\"\",IF(Summary!$B$5=3,IF(VLOOKUP(A20,Calendar!$A$3:$G$459,7,FALSE)=\"S\", \"\", VLOOKUP(A20,Calendar!$A$3:$G$459,7,FALSE)),IF(VLOOKUP(A20,Calendar!$A$3:$G$459,4,FALSE)=\"S\", \"\", VLOOKUP(A20,Calendar!$A$3:$G$459,4,FALSE))))","v":""},{"$f":"IF(Summary!$B$5=3,IF(C20=\"\",\"\",VLOOKUP(A20,Calendar!$A$3:$G$459,5,FALSE)),IF(C20=\"\",\"\",VLOOKUP(A20,Calendar!$A$3:$G$459,2,FALSE)))","v":""},null,null,null,null,0,null,null,""]
[413,null,{"$f":"IF(ISNA(IF(Summary!$B$5=3,IF(VLOOKUP(A21,Calendar!$A$3:$G$459,7,FALSE)=\"S\", \"\", VLOOKUP(A21,Calendar!$A$3:$G$459,7,FALSE)),IF(VLOOKUP(A21,Calendar!$A$3:$G$459,4,FALSE)=\"S\", \"\", VLOOKUP(A21,Calendar!$A$3:$G$459,4,FALSE)))),\"\",IF(Summary!$B$5=3,IF(VLOOKUP(A21,Calendar!$A$3:$G$459,7,FALSE)=\"S\", \"\", VLOOKUP(A21,Calendar!$A$3:$G$459,7,FALSE)),IF(VLOOKUP(A21,Calendar!$A$3:$G$459,4,FALSE)=\"S\", \"\", VLOOKUP(A21,Calendar!$A$3:$G$459,4,FALSE))))","v":"M"},{"$f":"IF(Summary!$B$5=3,IF(C21=\"\",\"\",VLOOKUP(A21,Calendar!$A$3:$G$459,5,FALSE)),IF(C21=\"\",\"\",VLOOKUP(A21,Calendar!$A$3:$G$459,2,FALSE)))","v":"2020-04-13"},null,null,null,null,0,null,null,""]
[414,null,{"$f":"IF(ISNA(IF(Summary!$B$5=3,IF(VLOOKUP(A22,Calendar!$A$3:$G$459,7,FALSE)=\"S\", \"\", VLOOKUP(A22,Calendar!$A$3:$G$459,7,FALSE)),IF(VLOOKUP(A22,Calendar!$A$3:$G$459,4,FALSE)=\"S\", \"\", VLOOKUP(A22,Calendar!$A$3:$G$459,4,FALSE)))),\"\",IF(Summary!$B$5=3,IF(VLOOKUP(A22,Calendar!$A$3:$G$459,7,FALSE)=\"S\", \"\", VLOOKUP(A22,Calendar!$A$3:$G$459,7,FALSE)),IF(VLOOKUP(A22,Calendar!$A$3:$G$459,4,FALSE)=\"S\", \"\", VLOOKUP(A22,Calendar!$A$3:$G$459,4,FALSE))))","v":"T"},{"$f":"IF(Summary!$B$5=3,IF(C22=\"\",\"\",VLOOKUP(A22,Calendar!$A$3:$G$459,5,FALSE)),IF(C22=\"\",\"\",VLOOKUP(A22,Calendar!$A$3:$G$459,2,FALSE)))","v":"2020-04-14"},null,null,null,null,0,null,null,""]
[415,null,{"$f":"IF(ISNA(IF(Summary!$B$5=3,IF(VLOOKUP(A23,Calendar!$A$3:$G$459,7,FALSE)=\"S\", \"\", VLOOKUP(A23,Calendar!$A$3:$G$459,7,FALSE)),IF(VLOOKUP(A23,Calendar!$A$3:$G$459,4,FALSE)=\"S\", \"\", VLOOKUP(A23,Calendar!$A$3:$G$459,4,FALSE)))),\"\",IF(Summary!$B$5=3,IF(VLOOKUP(A23,Calendar!$A$3:$G$459,7,FALSE)=\"S\", \"\", VLOOKUP(A23,Calendar!$A$3:$G$459,7,FALSE)),IF(VLOOKUP(A23,Calendar!$A$3:$G$459,4,FALSE)=\"S\", \"\", VLOOKUP(A23,Calendar!$A$3:$G$459,4,FALSE))))","v":"W"},{"$f":"IF(Summary!$B$5=3,IF(C23=\"\",\"\",VLOOKUP(A23,Calendar!$A$3:$G$459,5,FALSE)),IF(C23=\"\",\"\",VLOOKUP(A23,Calendar!$A$3:$G$459,2,FALSE)))","v":"2020-04-15"},null,null,null,null,0,null,null,""]
[416,null,{"$f":"IF(ISNA(IF(Summary!$B$5=3,IF(VLOOKUP(A24,Calendar!$A$3:$G$459,7,FALSE)=\"S\", \"\", VLOOKUP(A24,Calendar!$A$3:$G$459,7,FALSE)),IF(VLOOKUP(A24,Calendar!$A$3:$G$459,4,FALSE)=\"S\", \"\", VLOOKUP(A24,Calendar!$A$3:$G$459,4,FALSE)))),\"\",IF(Summary!$B$5=3,IF(VLOOKUP(A24,Calendar!$A$3:$G$459,7,FALSE)=\"S\", \"\", VLOOKUP(A24,Calendar!$A$3:$G$459,7,FALSE)),IF(VLOOKUP(A24,Calendar!$A$3:$G$459,4,FALSE)=\"S\", \"\", VLOOKUP(A24,Calendar!$A$3:$G$459,4,FALSE))))","v":"R"},{"$f":"IF(Summary!$B$5=3,IF(C24=\"\",\"\",VLOOKUP(A24,Calendar!$A$3:$G$459,5,FALSE)),IF(C24=\"\",\"\",VLOOKUP(A24,Calendar!$A$3:$G$459,2,FALSE)))","v":"2020-04-16"},null,null,null,null,0,null,null,""]
[417,null,{"$f":"IF(ISNA(IF(Summary!$B$5=3,IF(VLOOKUP(A25,Calendar!$A$3:$G$459,7,FALSE)=\"S\", \"\", VLOOKUP(A25,Calendar!$A$3:$G$459,7,FALSE)),IF(VLOOKUP(A25,Calendar!$A$3:$G$459,4,FALSE)=\"S\", \"\", VLOOKUP(A25,Calendar!$A$3:$G$459,4,FALSE)))),\"\",IF(Summary!$B$5=3,IF(VLOOKUP(A25,Calendar!$A$3:$G$459,7,FALSE)=\"S\", \"\", VLOOKUP(A25,Calendar!$A$3:$G$459,7,FALSE)),IF(VLOOKUP(A25,Calendar!$A$3:$G$459,4,FALSE)=\"S\", \"\", VLOOKUP(A25,Calendar!$A$3:$G$459,4,FALSE))))","v":"F"},{"$f":"IF(Summary!$B$5=3,IF(C25=\"\",\"\",VLOOKUP(A25,Calendar!$A$3:$G$459,5,FALSE)),IF(C25=\"\",\"\",VLOOKUP(A25,Calendar!$A$3:$G$459,2,FALSE)))","v":"2020-04-17"},null,null,null,null,0,null,null,""]
[418,null,{"$f":"IF(ISNA(IF(Summary!$B$5=3,IF(VLOOKUP(A26,Calendar!$A$3:$G$459,7,FALSE)=\"S\", \"\", VLOOKUP(A26,Calendar!$A$3:$G$459,7,FALSE)),IF(VLOOKUP(A26,Calendar!$A$3:$G$459,4,FALSE)=\"S\", \"\", VLOOKUP(A26,Calendar!$A$3:$G$459,4,FALSE)))),\"\",IF(Summary!$B$5=3,IF(VLOOKUP(A26,Calendar!$A$3:$G$459,7,FALSE)=\"S\", \"\", VLOOKUP(A26,Calendar!$A$3:$G$459,7,FALSE)),IF(VLOOKUP(A26,Calendar!$A$3:$G$459,4,FALSE)=\"S\", \"\", VLOOKUP(A26,Calendar!$A$3:$G$459,4,FALSE))))","v":""},{"$f":"IF(Summary!$B$5=3,IF(C26=\"\",\"\",VLOOKUP(A26,Calendar!$A$3:$G$459,5,FALSE)),IF(C26=\"\",\"\",VLOOKUP(A26,Calendar!$A$3:$G$459,2,FALSE)))","v":""},null,null,null,null,0,null,null,""]
[419,null,{"$f":"IF(ISNA(IF(Summary!$B$5=3,IF(VLOOKUP(A27,Calendar!$A$3:$G$459,7,FALSE)=\"S\", \"\", VLOOKUP(A27,Calendar!$A$3:$G$459,7,FALSE)),IF(VLOOKUP(A27,Calendar!$A$3:$G$459,4,FALSE)=\"S\", \"\", VLOOKUP(A27,Calendar!$A$3:$G$459,4,FALSE)))),\"\",IF(Summary!$B$5=3,IF(VLOOKUP(A27,Calendar!$A$3:$G$459,7,FALSE)=\"S\", \"\", VLOOKUP(A27,Calendar!$A$3:$G$459,7,FALSE)),IF(VLOOKUP(A27,Calendar!$A$3:$G$459,4,FALSE)=\"S\", \"\", VLOOKUP(A27,Calendar!$A$3:$G$459,4,FALSE))))","v":""},{"$f":"IF(Summary!$B$5=3,IF(C27=\"\",\"\",VLOOKUP(A27,Calendar!$A$3:$G$459,5,FALSE)),IF(C27=\"\",\"\",VLOOKUP(A27,Calendar!$A$3:$G$459,2,FALSE)))","v":""},null,null,null,null,0,null,null,""]
[420,null,{"$f":"IF(ISNA(IF(Summary!$B$5=3,IF(VLOOKUP(A28,Calendar!$A$3:$G$459,7,FALSE)=\"S\", \"\", VLOOKUP(A28,Calendar!$A$3:$G$459,7,FALSE)),IF(VLOOKUP(A28,Calendar!$A$3:$G$459,4,FALSE)=\"S\", \"\", VLOOKUP(A28,Calendar!$A$3:$G$459,4,FALSE)))),\"\",IF(Summary!$B$5=3,IF(VLOOKUP(A28,Calendar!$A$3:$G$459,7,FALSE)=\"S\", \"\", VLOOKUP(A28,Calendar!$A$3:$G$459,7,FALSE)),IF(VLOOKUP(A28,Calendar!$A$3:$G$459,4,FALSE)=\"S\", \"\", VLOOKUP(A28,Calendar!$A$3:$G$459,4,FALSE))))","v":"M"},{"$f":"IF(Summary!$B$5=3,IF(C28=\"\",\"\",VLOOKUP(A28,Calendar!$A$3:$G$459,5,FALSE)),IF(C28=\"\",\"\",VLOOKUP(A28,Calendar!$A$3:$G$459,2,FALSE)))","v":"2020-04-20"},null,null,null,null,0,null,null,""]
[421,null,{"$f":"IF(ISNA(IF(Summary!$B$5=3,IF(VLOOKUP(A29,Calendar!$A$3:$G$459,7,FALSE)=\"S\", \"\", VLOOKUP(A29,Calendar!$A$3:$G$459,7,FALSE)),IF(VLOOKUP(A29,Calendar!$A$3:$G$459,4,FALSE)=\"S\", \"\", VLOOKUP(A29,Calendar!$A$3:$G$459,4,FALSE)))),\"\",IF(Summary!$B$5=3,IF(VLOOKUP(A29,Calendar!$A$3:$G$459,7,FALSE)=\"S\", \"\", VLOOKUP(A29,Calendar!$A$3:$G$459,7,FALSE)),IF(VLOOKUP(A29,Calendar!$A$3:$G$459,4,FALSE)=\"S\", \"\", VLOOKUP(A29,Calendar!$A$3:$G$459,4,FALSE))))","v":"T"},{"$f":"IF(Summary!$B$5=3,IF(C29=\"\",\"\",VLOOKUP(A29,Calendar!$A$3:$G$459,5,FALSE)),IF(C29=\"\",\"\",VLOOKUP(A29,Calendar!$A$3:$G$459,2,FALSE)))","v":"2020-04-21"},null,null,null,null,0,null,null,""]
[422,null,{"$f":"IF(ISNA(IF(Summary!$B$5=3,IF(VLOOKUP(A30,Calendar!$A$3:$G$459,7,FALSE)=\"S\", \"\", VLOOKUP(A30,Calendar!$A$3:$G$459,7,FALSE)),IF(VLOOKUP(A30,Calendar!$A$3:$G$459,4,FALSE)=\"S\", \"\", VLOOKUP(A30,Calendar!$A$3:$G$459,4,FALSE)))),\"\",IF(Summary!$B$5=3,IF(VLOOKUP(A30,Calendar!$A$3:$G$459,7,FALSE)=\"S\", \"\", VLOOKUP(A30,Calendar!$A$3:$G$459,7,FALSE)),IF(VLOOKUP(A30,Calendar!$A$3:$G$459,4,FALSE)=\"S\", \"\", VLOOKUP(A30,Calendar!$A$3:$G$459,4,FALSE))))","v":"W"},{"$f":"IF(Summary!$B$5=3,IF(C30=\"\",\"\",VLOOKUP(A30,Calendar!$A$3:$G$459,5,FALSE)),IF(C30=\"\",\"\",VLOOKUP(A30,Calendar!$A$3:$G$459,2,FALSE)))","v":"2020-04-22"},null,null,null,null,0,null,null,""]
[423,null,{"$f":"IF(ISNA(IF(Summary!$B$5=3,IF(VLOOKUP(A31,Calendar!$A$3:$G$459,7,FALSE)=\"S\", \"\", VLOOKUP(A31,Calendar!$A$3:$G$459,7,FALSE)),IF(VLOOKUP(A31,Calendar!$A$3:$G$459,4,FALSE)=\"S\", \"\", VLOOKUP(A31,Calendar!$A$3:$G$459,4,FALSE)))),\"\",IF(Summary!$B$5=3,IF(VLOOKUP(A31,Calendar!$A$3:$G$459,7,FALSE)=\"S\", \"\", VLOOKUP(A31,Calendar!$A$3:$G$459,7,FALSE)),IF(VLOOKUP(A31,Calendar!$A$3:$G$459,4,FALSE)=\"S\", \"\", VLOOKUP(A31,Calendar!$A$3:$G$459,4,FALSE))))","v":"R"},{"$f":"IF(Summary!$B$5=3,IF(C31=\"\",\"\",VLOOKUP(A31,Calendar!$A$3:$G$459,5,FALSE)),IF(C31=\"\",\"\",VLOOKUP(A31,Calendar!$A$3:$G$459,2,FALSE)))","v":"2020-04-23"},null,null,null,null,0,null,null,""]
[424,null,{"$f":"IF(ISNA(IF(Summary!$B$5=3,IF(VLOOKUP(A32,Calendar!$A$3:$G$459,7,FALSE)=\"S\", \"\", VLOOKUP(A32,Calendar!$A$3:$G$459,7,FALSE)),IF(VLOOKUP(A32,Calendar!$A$3:$G$459,4,FALSE)=\"S\", \"\", VLOOKUP(A32,Calendar!$A$3:$G$459,4,FALSE)))),\"\",IF(Summary!$B$5=3,IF(VLOOKUP(A32,Calendar!$A$3:$G$459,7,FALSE)=\"S\", \"\", VLOOKUP(A32,Calendar!$A$3:$G$459,7,FALSE)),IF(VLOOKUP(A32,Calendar!$A$3:$G$459,4,FALSE)=\"S\", \"\", VLOOKUP(A32,Calendar!$A$3:$G$459,4,FALSE))))","v":"F"},{"$f":"IF(Summary!$B$5=3,IF(C32=\"\",\"\",VLOOKUP(A32,Calendar!$A$3:$G$459,5,FALSE)),IF(C32=\"\",\"\",VLOOKUP(A32,Calendar!$A$3:$G$459,2,FALSE)))","v":"2020-04-24"},null,null,null,null,0,null,null,""]
[425,null,{"$f":"IF(ISNA(IF(Summary!$B$5=3,IF(VLOOKUP(A33,Calendar!$A$3:$G$459,7,FALSE)=\"S\", \"\", VLOOKUP(A33,Calendar!$A$3:$G$459,7,FALSE)),IF(VLOOKUP(A33,Calendar!$A$3:$G$459,4,FALSE)=\"S\", \"\", VLOOKUP(A33,Calendar!$A$3:$G$459,4,FALSE)))),\"\",IF(Summary!$B$5=3,IF(VLOOKUP(A33,Calendar!$A$3:$G$459,7,FALSE)=\"S\", \"\", VLOOKUP(A33,Calendar!$A$3:$G$459,7,FALSE)),IF(VLOOKUP(A33,Calendar!$A$3:$G$459,4,FALSE)=\"S\", \"\", VLOOKUP(A33,Calendar!$A$3:$G$459,4,FALSE))))","v":""},{"$f":"IF(Summary!$B$5=3,IF(C33=\"\",\"\",VLOOKUP(A33,Calendar!$A$3:$G$459,5,FALSE)),IF(C33=\"\",\"\",VLOOKUP(A33,Calendar!$A$3:$G$459,2,FALSE)))","v":""},null,null,null,null,0,null,null,""]
[426,null,{"$f":"IF(ISNA(IF(Summary!$B$5=3,IF(VLOOKUP(A34,Calendar!$A$3:$G$459,7,FALSE)=\"S\", \"\", VLOOKUP(A34,Calendar!$A$3:$G$459,7,FALSE)),IF(VLOOKUP(A34,Calendar!$A$3:$G$459,4,FALSE)=\"S\", \"\", VLOOKUP(A34,Calendar!$A$3:$G$459,4,FALSE)))),\"\",IF(Summary!$B$5=3,IF(VLOOKUP(A34,Calendar!$A$3:$G$459,7,FALSE)=\"S\", \"\", VLOOKUP(A34,Calendar!$A$3:$G$459,7,FALSE)),IF(VLOOKUP(A34,Calendar!$A$3:$G$459,4,FALSE)=\"S\", \"\", VLOOKUP(A34,Calendar!$A$3:$G$459,4,FALSE))))","v":""},{"$f":"IF(Summary!$B$5=3,IF(C34=\"\",\"\",VLOOKUP(A34,Calendar!$A$3:$G$459,5,FALSE)),IF(C34=\"\",\"\",VLOOKUP(A34,Calendar!$A$3:$G$459,2,FALSE)))","v":""},null,null,null,null,0,null,null,""]
[427,null,{"$f":"IF(ISNA(IF(Summary!$B$5=3,IF(VLOOKUP(A35,Calendar!$A$3:$G$459,7,FALSE)=\"S\", \"\", VLOOKUP(A35,Calendar!$A$3:$G$459,7,FALSE)),IF(VLOOKUP(A35,Calendar!$A$3:$G$459,4,FALSE)=\"S\", \"\", VLOOKUP(A35,Calendar!$A$3:$G$459,4,FALSE)))),\"\",IF(Summary!$B$5=3,IF(VLOOKUP(A35,Calendar!$A$3:$G$459,7,FALSE)=\"S\", \"\", VLOOKUP(A35,Calendar!$A$3:$G$459,7,FALSE)),IF(VLOOKUP(A35,Calendar!$A$3:$G$459,4,FALSE)=\"S\", \"\", VLOOKUP(A35,Calendar!$A$3:$G$459,4,FALSE))))","v":"M"},{"$f":"IF(Summary!$B$5=3,IF(C35=\"\",\"\",VLOOKUP(A35,Calendar!$A$3:$G$459,5,FALSE)),IF(C35=\"\",\"\",VLOOKUP(A35,Calendar!$A$3:$G$459,2,FALSE)))","v":"2020-04-27"},null,null,null,null,0,null,null,""]
[428,null,{"$f":"IF(ISNA(IF(Summary!$B$5=3,IF(VLOOKUP(A36,Calendar!$A$3:$G$459,7,FALSE)=\"S\", \"\", VLOOKUP(A36,Calendar!$A$3:$G$459,7,FALSE)),IF(VLOOKUP(A36,Calendar!$A$3:$G$459,4,FALSE)=\"S\", \"\", VLOOKUP(A36,Calendar!$A$3:$G$459,4,FALSE)))),\"\",IF(Summary!$B$5=3,IF(VLOOKUP(A36,Calendar!$A$3:$G$459,7,FALSE)=\"S\", \"\", VLOOKUP(A36,Calendar!$A$3:$G$459,7,FALSE)),IF(VLOOKUP(A36,Calendar!$A$3:$G$459,4,FALSE)=\"S\", \"\", VLOOKUP(A36,Calendar!$A$3:$G$459,4,FALSE))))","v":"T"},{"$f":"IF(Summary!$B$5=3,IF(C36=\"\",\"\",VLOOKUP(A36,Calendar!$A$3:$G$459,5,FALSE)),IF(C36=\"\",\"\",VLOOKUP(A36,Calendar!$A$3:$G$459,2,FALSE)))","v":"2020-04-28"},null,null,null,null,0,null,null,""]
[429,null,{"$f":"IF(ISNA(IF(Summary!$B$5=3,IF(VLOOKUP(A37,Calendar!$A$3:$G$459,7,FALSE)=\"S\", \"\", VLOOKUP(A37,Calendar!$A$3:$G$459,7,FALSE)),IF(VLOOKUP(A37,Calendar!$A$3:$G$459,4,FALSE)=\"S\", \"\", VLOOKUP(A37,Calendar!$A$3:$G$459,4,FALSE)))),\"\",IF(Summary!$B$5=3,IF(VLOOKUP(A37,Calendar!$A$3:$G$459,7,FALSE)=\"S\", \"\", VLOOKUP(A37,Calendar!$A$3:$G$459,7,FALSE)),IF(VLOOKUP(A37,Calendar!$A$3:$G$459,4,FALSE)=\"S\", \"\", VLOOKUP(A37,Calendar!$A$3:$G$459,4,FALSE))))","v":"W"},{"$f":"IF(Summary!$B$5=3,IF(C37=\"\",\"\",VLOOKUP(A37,Calendar!$A$3:$G$459,5,FALSE)),IF(C37=\"\",\"\",VLOOKUP(A37,Calendar!$A$3:$G$459,2,FALSE)))","v":"2020-04-29"},null,null,null,null,0,null,null,""]
[430,null,{"$f":"IF(ISNA(IF(Summary!$B$5=3,IF(VLOOKUP(A38,Calendar!$A$3:$G$459,7,FALSE)=\"S\", \"\", VLOOKUP(A38,Calendar!$A$3:$G$459,7,FALSE)),IF(VLOOKUP(A38,Calendar!$A$3:$G$459,4,FALSE)=\"S\", \"\", VLOOKUP(A38,Calendar!$A$3:$G$459,4,FALSE)))),\"\",IF(Summary!$B$5=3,IF(VLOOKUP(A38,Calendar!$A$3:$G$459,7,FALSE)=\"S\", \"\", VLOOKUP(A38,Calendar!$A$3:$G$459,7,FALSE)),IF(VLOOKUP(A38,Calendar!$A$3:$G$459,4,FALSE)=\"S\", \"\", VLOOKUP(A38,Calendar!$A$3:$G$459,4,FALSE))))","v":"R"},{"$f":"IF(Summary!$B$5=3,IF(C38=\"\",\"\",VLOOKUP(A38,Calendar!$A$3:$G$459,5,FALSE)),IF(C38=\"\",\"\",VLOOKUP(A38,Calendar!$A$3:$G$459,2,FALSE)))","v":"2020-04-30"},null,null,null,null,0,null,null,""]
[null,null,{"$f":"IF(ISNA(IF(Summary!$B$5=3,IF(VLOOKUP(A39,Calendar!$A$3:$G$459,7,FALSE)=\"S\", \"\", VLOOKUP(A39,Calendar!$A$3:$G$459,7,FALSE)),IF(VLOOKUP(A39,Calendar!$A$3:$G$459,4,FALSE)=\"S\", \"\", VLOOKUP(A39,Calendar!$A$3:$G$459,4,FALSE)))),\"\",IF(Summary!$B$5=3,IF(VLOOKUP(A39,Calendar!$A$3:$G$459,7,FALSE)=\"S\", \"\", VLOOKUP(A39,Calendar!$A$3:$G$459,7,FALSE)),IF(VLOOKUP(A39,Calendar!$A$3:$G$459,4,FALSE)=\"S\", \"\", VLOOKUP(A39,Calendar!$A$3:$G$459,4,FALSE))))","v":""},{"$f":"IF(Summary!$B$5=3,IF(C39=\"\",\"\",VLOOKUP(A39,Calendar!$A$3:$G$459,5,FALSE)),IF(C39=\"\",\"\",VLOOKUP(A39,Calendar!$A$3:$G$459,2,FALSE)))","v":""},null,null,null,null,0,null,null,""]
[null,null,null,"Total Minutes",{"$f":"SUM(E9:E39)","v":0},{"$f":"SUM(F9:F39)","v":0},0,0,0,null,null,{"$f":"IF(SUM(E40:H40)>COUNTA(E9:E39)*390,\"The sum total for all cost objectives exceeds the maximum anticipated value based upon the number of days worked. Confirm minutes claimed for each day.\",\"\")","v":""}]
[null,null,null,"Total Hours",{"$f":"E40/60","v":0},{"$f":"F40/60","v":0},0,0,0]
[]
[]
[null,null,"Notes"]
[]
[]
[]
[]
[]
[]
[]
[]
[]
[]
[]
[null,null,null,null,"Kansas State Department of Education",null,null,null,"Personnel Activity Report"]
[null,null,null,null,"Fiscal Auditing",null,null,null,"Updated 9/20/18"]
[null,null,null,null,"785-296-4976"]
[null,null,null,null,"https://www.ksde.org/Agency/Fiscal-and-Administrative-Services/Fiscal-Auditing"]
[]
[]
[null,null,"The Kansas State Department of Education does not discriminate on the basis of race, color, national origin, sex, disability, or age in its programs and activities and provides equal access to the Boy Scouts and other designated youth groups. The following person has been designated to handle inquiries regarding the nondiscrimination policies: KSDE General Counsel, Office of General Counsel, KSDE, Landon State Office Building, 900 S.W. Jackson, Suite 102, Topeka, KS 66612, (785) 296-3204."]

{"sheet":"May","index":12,"n_rows":62,"n_cols":12,"rows_kept":62,"cut":false,"hidden":false,"merged":[[61,2,64,8],[1,2,1,8],[2,2,2,8],[3,2,3,8],[4,2,4,8],[46,2,46,8],[47,2,47,8],[48,2,48,8],[49,2,49,8],[5,2,5,8],[6,2,6,8],[43,3,43,8],[44,2,44,8],[45,2,45,8]]}
[]
[]
[null,null,"Personnel Activity Report"]
[null,null,"Regular School Year"]
[null,null,"May"]
[null,null,{"$f":"IF(Summary!$E$8<>\"\",Summary!$E$8,\" \")","v":" "}]
[null,null,{"$f":"IF(Summary!$E$9<>\"\",Summary!$E$9,\" \")","v":" "}]
[null,null,"Day","Date","Special Ed","General Ed","Other","Other","Totals",null,null,{"$f":"IF(OR(AND(F8=\"\",COUNTA(F9:F39)>0),AND(G8=\"\",COUNTA(G9:G39)>0),AND(H8=\"\",COUNTA(H9:H39)>0)),\"<<< You must identify the cost objective in the column heading.\",\"\")","v":""}]
[501,null,{"$f":"IF(ISNA(IF(Summary!$B$5=3,IF(VLOOKUP(A9,Calendar!$A$34:$G$459,7,FALSE)=\"S\", \"\", VLOOKUP(A9,Calendar!$A$34:$G$459,7,FALSE)),IF(VLOOKUP(A9,Calendar!$A$34:$G$459,4,FALSE)=\"S\", \"\", VLOOKUP(A9,Calendar!$A$34:$G$459,4,FALSE)))),\"\",IF(Summary!$B$5=3,IF(VLOOKUP(A9,Calendar!$A$34:$G$459,7,FALSE)=\"S\", \"\", VLOOKUP(A9,Calendar!$A$34:$G$459,7,FALSE)),IF(VLOOKUP(A9,Calendar!$A$34:$G$459,4,FALSE)=\"S\", \"\", VLOOKUP(A9,Calendar!$A$34:$G$459,4,FALSE))))","v":"F"},{"$f":"IF(Summary!$B$5=3,IF(C9=\"\",\"\",VLOOKUP(A9,Calendar!$A$34:$G$459,5,FALSE)),IF(C9=\"\",\"\",VLOOKUP(A9,Calendar!$A$34:$G$459,2,FALSE)))","v":"2020-05-01"},null,null,null,null,{"$f":"MIN(1440,SUM(E9:H9))","v":0},null,null,{"$f":"IF(I9>390, \"<<< Day exceeds 390 minutes. Confirm reported time.\",\"\")","v":""}]
[502,null,{"$f":"IF(ISNA(IF(Summary!$B$5=3,IF(VLOOKUP(A10,Calendar!$A$34:$G$459,7,FALSE)=\"S\", \"\", VLOOKUP(A10,Calendar!$A$34:$G$459,7,FALSE)),IF(VLOOKUP(A10,Calendar!$A$34:$G$459,4,FALSE)=\"S\", \"\", VLOOKUP(A10,Calendar!$A$34:$G$459,4,FALSE)))),\"\",IF(Summary!$B$5=3,IF(VLOOKUP(A10,Calendar!$A$34:$G$459,7,FALSE)=\"S\", \"\", VLOOKUP(A10,Calendar!$A$34:$G$459,7,FALSE)),IF(VLOOKUP(A10,Calendar!$A$34:$G$459,4,FALSE)=\"S\", \"\", VLOOKUP(A10,Calendar!$A$34:$G$459,4,FALSE))))","v":""},{"$f":"IF(Summary!$B$5=3,IF(C10=\"\",\"\",VLOOKUP(A10,Calendar!$A$34:$G$459,5,FALSE)),IF(C10=\"\",\"\",VLOOKUP(A10,Calendar!$A$34:$G$459,2,FALSE)))","v":""},null,null,null,null,{"$f":"MIN(1440,SUM(E10:H10))","v":0},null,null,{"$f":"IF(I10>390, \"<<< Day exceeds 390 minutes. Confirm reported time.\",\"\")","v":""}]
[503,null,{"$f":"IF(ISNA(IF(Summary!$B$5=3,IF(VLOOKUP(A11,Calendar!$A$34:$G$459,7,FALSE)=\"S\", \"\", VLOOKUP(A11,Calendar!$A$34:$G$459,7,FALSE)),IF(VLOOKUP(A11,Calendar!$A$34:$G$459,4,FALSE)=\"S\", \"\", VLOOKUP(A11,Calendar!$A$34:$G$459,4,FALSE)))),\"\",IF(Summary!$B$5=3,IF(VLOOKUP(A11,Calendar!$A$34:$G$459,7,FALSE)=\"S\", \"\", VLOOKUP(A11,Calendar!$A$34:$G$459,7,FALSE)),IF(VLOOKUP(A11,Calendar!$A$34:$G$459,4,FALSE)=\"S\", \"\", VLOOKUP(A11,Calendar!$A$34:$G$459,4,FALSE))))","v":""},{"$f":"IF(Summary!$B$5=3,IF(C11=\"\",\"\",VLOOKUP(A11,Calendar!$A$34:$G$459,5,FALSE)),IF(C11=\"\",\"\",VLOOKUP(A11,Calendar!$A$34:$G$459,2,FALSE)))","v":""},null,null,null,null,0,null,null,""]
[504,null,{"$f":"IF(ISNA(IF(Summary!$B$5=3,IF(VLOOKUP(A12,Calendar!$A$34:$G$459,7,FALSE)=\"S\", \"\", VLOOKUP(A12,Calendar!$A$34:$G$459,7,FALSE)),IF(VLOOKUP(A12,Calendar!$A$34:$G$459,4,FALSE)=\"S\", \"\", VLOOKUP(A12,Calendar!$A$34:$G$459,4,FALSE)))),\"\",IF(Summary!$B$5=3,IF(VLOOKUP(A12,Calendar!$A$34:$G$459,7,FALSE)=\"S\", \"\", VLOOKUP(A12,Calendar!$A$34:$G$459,7,FALSE)),IF(VLOOKUP(A12,Calendar!$A$34:$G$459,4,FALSE)=\"S\", \"\", VLOOKUP(A12,Calendar!$A$34:$G$459,4,FALSE))))","v":"M"},{"$f":"IF(Summary!$B$5=3,IF(C12=\"\",\"\",VLOOKUP(A12,Calendar!$A$34:$G$459,5,FALSE)),IF(C12=\"\",\"\",VLOOKUP(A12,Calendar!$A$34:$G$459,2,FALSE)))","v":"2020-05-04"},null,null,null,null,0,null,null,""]
[505,null,{"$f":"IF(ISNA(IF(Summary!$B$5=3,IF(VLOOKUP(A13,Calendar!$A$34:$G$459,7,FALSE)=\"S\", \"\", VLOOKUP(A13,Calendar!$A$34:$G$459,7,FALSE)),IF(VLOOKUP(A13,Calendar!$A$34:$G$459,4,FALSE)=\"S\", \"\", VLOOKUP(A13,Calendar!$A$34:$G$459,4,FALSE)))),\"\",IF(Summary!$B$5=3,IF(VLOOKUP(A13,Calendar!$A$34:$G$459,7,FALSE)=\"S\", \"\", VLOOKUP(A13,Calendar!$A$34:$G$459,7,FALSE)),IF(VLOOKUP(A13,Calendar!$A$34:$G$459,4,FALSE)=\"S\", \"\", VLOOKUP(A13,Calendar!$A$34:$G$459,4,FALSE))))","v":"T"},{"$f":"IF(Summary!$B$5=3,IF(C13=\"\",\"\",VLOOKUP(A13,Calendar!$A$34:$G$459,5,FALSE)),IF(C13=\"\",\"\",VLOOKUP(A13,Calendar!$A$34:$G$459,2,FALSE)))","v":"2020-05-05"},null,null,null,null,0,null,null,""]
[506,null,{"$f":"IF(ISNA(IF(Summary!$B$5=3,IF(VLOOKUP(A14,Calendar!$A$34:$G$459,7,FALSE)=\"S\", \"\", VLOOKUP(A14,Calendar!$A$34:$G$459,7,FALSE)),IF(VLOOKUP(A14,Calendar!$A$34:$G$459,4,FALSE)=\"S\", \"\", VLOOKUP(A14,Calendar!$A$34:$G$459,4,FALSE)))),\"\",IF(Summary!$B$5=3,IF(VLOOKUP(A14,Calendar!$A$34:$G$459,7,FALSE)=\"S\", \"\", VLOOKUP(A14,Calendar!$A$34:$G$459,7,FALSE)),IF(VLOOKUP(A14,Calendar!$A$34:$G$459,4,FALSE)=\"S\", \"\", VLOOKUP(A14,Calendar!$A$34:$G$459,4,FALSE))))","v":"W"},{"$f":"IF(Summary!$B$5=3,IF(C14=\"\",\"\",VLOOKUP(A14,Calendar!$A$34:$G$459,5,FALSE)),IF(C14=\"\",\"\",VLOOKUP(A14,Calendar!$A$34:$G$459,2,FALSE)))","v":"2020-05-06"},null,null,null,null,0,null,null,""]
[507,null,{"$f":"IF(ISNA(IF(Summary!$B$5=3,IF(VLOOKUP(A15,Calendar!$A$34:$G$459,7,FALSE)=\"S\", \"\", VLOOKUP(A15,Calendar!$A$34:$G$459,7,FALSE)),IF(VLOOKUP(A15,Calendar!$A$34:$G$459,4,FALSE)=\"S\", \"\", VLOOKUP(A15,Calendar!$A$34:$G$459,4,FALSE)))),\"\",IF(Summary!$B$5=3,IF(VLOOKUP(A15,Calendar!$A$34:$G$459,7,FALSE)=\"S\", \"\", VLOOKUP(A15,Calendar!$A$34:$G$459,7,FALSE)),IF(VLOOKUP(A15,Calendar!$A$34:$G$459,4,FALSE)=\"S\", \"\", VLOOKUP(A15,Calendar!$A$34:$G$459,4,FALSE))))","v":"R"},{"$f":"IF(Summary!$B$5=3,IF(C15=\"\",\"\",VLOOKUP(A15,Calendar!$A$34:$G$459,5,FALSE)),IF(C15=\"\",\"\",VLOOKUP(A15,Calendar!$A$34:$G$459,2,FALSE)))","v":"2020-05-07"},null,null,null,null,0,null,null,""]
[508,null,{"$f":"IF(ISNA(IF(Summary!$B$5=3,IF(VLOOKUP(A16,Calendar!$A$34:$G$459,7,FALSE)=\"S\", \"\", VLOOKUP(A16,Calendar!$A$34:$G$459,7,FALSE)),IF(VLOOKUP(A16,Calendar!$A$34:$G$459,4,FALSE)=\"S\", \"\", VLOOKUP(A16,Calendar!$A$34:$G$459,4,FALSE)))),\"\",IF(Summary!$B$5=3,IF(VLOOKUP(A16,Calendar!$A$34:$G$459,7,FALSE)=\"S\", \"\", VLOOKUP(A16,Calendar!$A$34:$G$459,7,FALSE)),IF(VLOOKUP(A16,Calendar!$A$34:$G$459,4,FALSE)=\"S\", \"\", VLOOKUP(A16,Calendar!$A$34:$G$459,4,FALSE))))","v":"F"},{"$f":"IF(Summary!$B$5=3,IF(C16=\"\",\"\",VLOOKUP(A16,Calendar!$A$34:$G$459,5,FALSE)),IF(C16=\"\",\"\",VLOOKUP(A16,Calendar!$A$34:$G$459,2,FALSE)))","v":"2020-05-08"},null,null,null,null,0,null,null,""]
[509,null,{"$f":"IF(ISNA(IF(Summary!$B$5=3,IF(VLOOKUP(A17,Calendar!$A$34:$G$459,7,FALSE)=\"S\", \"\", VLOOKUP(A17,Calendar!$A$34:$G$459,7,FALSE)),IF(VLOOKUP(A17,Calendar!$A$34:$G$459,4,FALSE)=\"S\", \"\", VLOOKUP(A17,Calendar!$A$34:$G$459,4,FALSE)))),\"\",IF(Summary!$B$5=3,IF(VLOOKUP(A17,Calendar!$A$34:$G$459,7,FALSE)=\"S\", \"\", VLOOKUP(A17,Calendar!$A$34:$G$459,7,FALSE)),IF(VLOOKUP(A17,Calendar!$A$34:$G$459,4,FALSE)=\"S\", \"\", VLOOKUP(A17,Calendar!$A$34:$G$459,4,FALSE))))","v":""},{"$f":"IF(Summary!$B$5=3,IF(C17=\"\",\"\",VLOOKUP(A17,Calendar!$A$34:$G$459,5,FALSE)),IF(C17=\"\",\"\",VLOOKUP(A17,Calendar!$A$34:$G$459,2,FALSE)))","v":""},null,null,null,null,0,null,null,""]
[510,null,{"$f":"IF(ISNA(IF(Summary!$B$5=3,IF(VLOOKUP(A18,Calendar!$A$34:$G$459,7,FALSE)=\"S\", \"\", VLOOKUP(A18,Calendar!$A$34:$G$459,7,FALSE)),IF(VLOOKUP(A18,Calendar!$A$34:$G$459,4,FALSE)=\"S\", \"\", VLOOKUP(A18,Calendar!$A$34:$G$459,4,FALSE)))),\"\",IF(Summary!$B$5=3,IF(VLOOKUP(A18,Calendar!$A$34:$G$459,7,FALSE)=\"S\", \"\", VLOOKUP(A18,Calendar!$A$34:$G$459,7,FALSE)),IF(VLOOKUP(A18,Calendar!$A$34:$G$459,4,FALSE)=\"S\", \"\", VLOOKUP(A18,Calendar!$A$34:$G$459,4,FALSE))))","v":""},{"$f":"IF(Summary!$B$5=3,IF(C18=\"\",\"\",VLOOKUP(A18,Calendar!$A$34:$G$459,5,FALSE)),IF(C18=\"\",\"\",VLOOKUP(A18,Calendar!$A$34:$G$459,2,FALSE)))","v":""},null,null,null,null,0,null,null,""]
[511,null,{"$f":"IF(ISNA(IF(Summary!$B$5=3,IF(VLOOKUP(A19,Calendar!$A$34:$G$459,7,FALSE)=\"S\", \"\", VLOOKUP(A19,Calendar!$A$34:$G$459,7,FALSE)),IF(VLOOKUP(A19,Calendar!$A$34:$G$459,4,FALSE)=\"S\", \"\", VLOOKUP(A19,Calendar!$A$34:$G$459,4,FALSE)))),\"\",IF(Summary!$B$5=3,IF(VLOOKUP(A19,Calendar!$A$34:$G$459,7,FALSE)=\"S\", \"\", VLOOKUP(A19,Calendar!$A$34:$G$459,7,FALSE)),IF(VLOOKUP(A19,Calendar!$A$34:$G$459,4,FALSE)=\"S\", \"\", VLOOKUP(A19,Calendar!$A$34:$G$459,4,FALSE))))","v":"M"},{"$f":"IF(Summary!$B$5=3,IF(C19=\"\",\"\",VLOOKUP(A19,Calendar!$A$34:$G$459,5,FALSE)),IF(C19=\"\",\"\",VLOOKUP(A19,Calendar!$A$34:$G$459,2,FALSE)))","v":"2020-05-11"},null,null,null,null,0,null,null,""]
[512,null,{"$f":"IF(ISNA(IF(Summary!$B$5=3,IF(VLOOKUP(A20,Calendar!$A$34:$G$459,7,FALSE)=\"S\", \"\", VLOOKUP(A20,Calendar!$A$34:$G$459,7,FALSE)),IF(VLOOKUP(A20,Calendar!$A$34:$G$459,4,FALSE)=\"S\", \"\", VLOOKUP(A20,Calendar!$A$34:$G$459,4,FALSE)))),\"\",IF(Summary!$B$5=3,IF(VLOOKUP(A20,Calendar!$A$34:$G$459,7,FALSE)=\"S\", \"\", VLOOKUP(A20,Calendar!$A$34:$G$459,7,FALSE)),IF(VLOOKUP(A20,Calendar!$A$34:$G$459,4,FALSE)=\"S\", \"\", VLOOKUP(A20,Calendar!$A$34:$G$459,4,FALSE))))","v":"T"},{"$f":"IF(Summary!$B$5=3,IF(C20=\"\",\"\",VLOOKUP(A20,Calendar!$A$34:$G$459,5,FALSE)),IF(C20=\"\",\"\",VLOOKUP(A20,Calendar!$A$34:$G$459,2,FALSE)))","v":"2020-05-12"},null,null,null,null,0,null,null,""]
[513,null,{"$f":"IF(ISNA(IF(Summary!$B$5=3,IF(VLOOKUP(A21,Calendar!$A$34:$G$459,7,FALSE)=\"S\", \"\", VLOOKUP(A21,Calendar!$A$34:$G$459,7,FALSE)),IF(VLOOKUP(A21,Calendar!$A$34:$G$459,4,FALSE)=\"S\", \"\", VLOOKUP(A21,Calendar!$A$34:$G$459,4,FALSE)))),\"\",IF(Summary!$B$5=3,IF(VLOOKUP(A21,Calendar!$A$34:$G$459,7,FALSE)=\"S\", \"\", VLOOKUP(A21,Calendar!$A$34:$G$459,7,FALSE)),IF(VLOOKUP(A21,Calendar!$A$34:$G$459,4,FALSE)=\"S\", \"\", VLOOKUP(A21,Calendar!$A$34:$G$459,4,FALSE))))","v":"W"},{"$f":"IF(Summary!$B$5=3,IF(C21=\"\",\"\",VLOOKUP(A21,Calendar!$A$34:$G$459,5,FALSE)),IF(C21=\"\",\"\",VLOOKUP(A21,Calendar!$A$34:$G$459,2,FALSE)))","v":"2020-05-13"},null,null,null,null,0,null,null,""]
[514,null,{"$f":"IF(ISNA(IF(Summary!$B$5=3,IF(VLOOKUP(A22,Calendar!$A$34:$G$459,7,FALSE)=\"S\", \"\", VLOOKUP(A22,Calendar!$A$34:$G$459,7,FALSE)),IF(VLOOKUP(A22,Calendar!$A$34:$G$459,4,FALSE)=\"S\", \"\", VLOOKUP(A22,Calendar!$A$34:$G$459,4,FALSE)))),\"\",IF(Summary!$B$5=3,IF(VLOOKUP(A22,Calendar!$A$34:$G$459,7,FALSE)=\"S\", \"\", VLOOKUP(A22,Calendar!$A$34:$G$459,7,FALSE)),IF(VLOOKUP(A22,Calendar!$A$34:$G$459,4,FALSE)=\"S\", \"\", VLOOKUP(A22,Calendar!$A$34:$G$459,4,FALSE))))","v":"R"},{"$f":"IF(Summary!$B$5=3,IF(C22=\"\",\"\",VLOOKUP(A22,Calendar!$A$34:$G$459,5,FALSE)),IF(C22=\"\",\"\",VLOOKUP(A22,Calendar!$A$34:$G$459,2,FALSE)))","v":"2020-05-14"},null,null,null,null,0,null,null,""]
[515,null,{"$f":"IF(ISNA(IF(Summary!$B$5=3,IF(VLOOKUP(A23,Calendar!$A$34:$G$459,7,FALSE)=\"S\", \"\", VLOOKUP(A23,Calendar!$A$34:$G$459,7,FALSE)),IF(VLOOKUP(A23,Calendar!$A$34:$G$459,4,FALSE)=\"S\", \"\", VLOOKUP(A23,Calendar!$A$34:$G$459,4,FALSE)))),\"\",IF(Summary!$B$5=3,IF(VLOOKUP(A23,Calendar!$A$34:$G$459,7,FALSE)=\"S\", \"\", VLOOKUP(A23,Calendar!$A$34:$G$459,7,FALSE)),IF(VLOOKUP(A23,Calendar!$A$34:$G$459,4,FALSE)=\"S\", \"\", VLOOKUP(A23,Calendar!$A$34:$G$459,4,FALSE))))","v":"F"},{"$f":"IF(Summary!$B$5=3,IF(C23=\"\",\"\",VLOOKUP(A23,Calendar!$A$34:$G$459,5,FALSE)),IF(C23=\"\",\"\",VLOOKUP(A23,Calendar!$A$34:$G$459,2,FALSE)))","v":"2020-05-15"},null,null,null,null,0,null,null,""]
[516,null,{"$f":"IF(ISNA(IF(Summary!$B$5=3,IF(VLOOKUP(A24,Calendar!$A$34:$G$459,7,FALSE)=\"S\", \"\", VLOOKUP(A24,Calendar!$A$34:$G$459,7,FALSE)),IF(VLOOKUP(A24,Calendar!$A$34:$G$459,4,FALSE)=\"S\", \"\", VLOOKUP(A24,Calendar!$A$34:$G$459,4,FALSE)))),\"\",IF(Summary!$B$5=3,IF(VLOOKUP(A24,Calendar!$A$34:$G$459,7,FALSE)=\"S\", \"\", VLOOKUP(A24,Calendar!$A$34:$G$459,7,FALSE)),IF(VLOOKUP(A24,Calendar!$A$34:$G$459,4,FALSE)=\"S\", \"\", VLOOKUP(A24,Calendar!$A$34:$G$459,4,FALSE))))","v":""},{"$f":"IF(Summary!$B$5=3,IF(C24=\"\",\"\",VLOOKUP(A24,Calendar!$A$34:$G$459,5,FALSE)),IF(C24=\"\",\"\",VLOOKUP(A24,Calendar!$A$34:$G$459,2,FALSE)))","v":""},null,null,null,null,0,null,null,""]
[517,null,{"$f":"IF(ISNA(IF(Summary!$B$5=3,IF(VLOOKUP(A25,Calendar!$A$34:$G$459,7,FALSE)=\"S\", \"\", VLOOKUP(A25,Calendar!$A$34:$G$459,7,FALSE)),IF(VLOOKUP(A25,Calendar!$A$34:$G$459,4,FALSE)=\"S\", \"\", VLOOKUP(A25,Calendar!$A$34:$G$459,4,FALSE)))),\"\",IF(Summary!$B$5=3,IF(VLOOKUP(A25,Calendar!$A$34:$G$459,7,FALSE)=\"S\", \"\", VLOOKUP(A25,Calendar!$A$34:$G$459,7,FALSE)),IF(VLOOKUP(A25,Calendar!$A$34:$G$459,4,FALSE)=\"S\", \"\", VLOOKUP(A25,Calendar!$A$34:$G$459,4,FALSE))))","v":""},{"$f":"IF(Summary!$B$5=3,IF(C25=\"\",\"\",VLOOKUP(A25,Calendar!$A$34:$G$459,5,FALSE)),IF(C25=\"\",\"\",VLOOKUP(A25,Calendar!$A$34:$G$459,2,FALSE)))","v":""},null,null,null,null,0,null,null,""]
[518,null,{"$f":"IF(ISNA(IF(Summary!$B$5=3,IF(VLOOKUP(A26,Calendar!$A$34:$G$459,7,FALSE)=\"S\", \"\", VLOOKUP(A26,Calendar!$A$34:$G$459,7,FALSE)),IF(VLOOKUP(A26,Calendar!$A$34:$G$459,4,FALSE)=\"S\", \"\", VLOOKUP(A26,Calendar!$A$34:$G$459,4,FALSE)))),\"\",IF(Summary!$B$5=3,IF(VLOOKUP(A26,Calendar!$A$34:$G$459,7,FALSE)=\"S\", \"\", VLOOKUP(A26,Calendar!$A$34:$G$459,7,FALSE)),IF(VLOOKUP(A26,Calendar!$A$34:$G$459,4,FALSE)=\"S\", \"\", VLOOKUP(A26,Calendar!$A$34:$G$459,4,FALSE))))","v":"M"},{"$f":"IF(Summary!$B$5=3,IF(C26=\"\",\"\",VLOOKUP(A26,Calendar!$A$34:$G$459,5,FALSE)),IF(C26=\"\",\"\",VLOOKUP(A26,Calendar!$A$34:$G$459,2,FALSE)))","v":"2020-05-18"},null,null,null,null,0,null,null,""]
[519,null,{"$f":"IF(ISNA(IF(Summary!$B$5=3,IF(VLOOKUP(A27,Calendar!$A$34:$G$459,7,FALSE)=\"S\", \"\", VLOOKUP(A27,Calendar!$A$34:$G$459,7,FALSE)),IF(VLOOKUP(A27,Calendar!$A$34:$G$459,4,FALSE)=\"S\", \"\", VLOOKUP(A27,Calendar!$A$34:$G$459,4,FALSE)))),\"\",IF(Summary!$B$5=3,IF(VLOOKUP(A27,Calendar!$A$34:$G$459,7,FALSE)=\"S\", \"\", VLOOKUP(A27,Calendar!$A$34:$G$459,7,FALSE)),IF(VLOOKUP(A27,Calendar!$A$34:$G$459,4,FALSE)=\"S\", \"\", VLOOKUP(A27,Calendar!$A$34:$G$459,4,FALSE))))","v":"T"},{"$f":"IF(Summary!$B$5=3,IF(C27=\"\",\"\",VLOOKUP(A27,Calendar!$A$34:$G$459,5,FALSE)),IF(C27=\"\",\"\",VLOOKUP(A27,Calendar!$A$34:$G$459,2,FALSE)))","v":"2020-05-19"},null,null,null,null,0,null,null,""]
[520,null,{"$f":"IF(ISNA(IF(Summary!$B$5=3,IF(VLOOKUP(A28,Calendar!$A$34:$G$459,7,FALSE)=\"S\", \"\", VLOOKUP(A28,Calendar!$A$34:$G$459,7,FALSE)),IF(VLOOKUP(A28,Calendar!$A$34:$G$459,4,FALSE)=\"S\", \"\", VLOOKUP(A28,Calendar!$A$34:$G$459,4,FALSE)))),\"\",IF(Summary!$B$5=3,IF(VLOOKUP(A28,Calendar!$A$34:$G$459,7,FALSE)=\"S\", \"\", VLOOKUP(A28,Calendar!$A$34:$G$459,7,FALSE)),IF(VLOOKUP(A28,Calendar!$A$34:$G$459,4,FALSE)=\"S\", \"\", VLOOKUP(A28,Calendar!$A$34:$G$459,4,FALSE))))","v":"W"},{"$f":"IF(Summary!$B$5=3,IF(C28=\"\",\"\",VLOOKUP(A28,Calendar!$A$34:$G$459,5,FALSE)),IF(C28=\"\",\"\",VLOOKUP(A28,Calendar!$A$34:$G$459,2,FALSE)))","v":"2020-05-20"},null,null,null,null,0,null,null,""]
[521,null,{"$f":"IF(ISNA(IF(Summary!$B$5=3,IF(VLOOKUP(A29,Calendar!$A$34:$G$459,7,FALSE)=\"S\", \"\", VLOOKUP(A29,Calendar!$A$34:$G$459,7,FALSE)),IF(VLOOKUP(A29,Calendar!$A$34:$G$459,4,FALSE)=\"S\", \"\", VLOOKUP(A29,Calendar!$A$34:$G$459,4,FALSE)))),\"\",IF(Summary!$B$5=3,IF(VLOOKUP(A29,Calendar!$A$34:$G$459,7,FALSE)=\"S\", \"\", VLOOKUP(A29,Calendar!$A$34:$G$459,7,FALSE)),IF(VLOOKUP(A29,Calendar!$A$34:$G$459,4,FALSE)=\"S\", \"\", VLOOKUP(A29,Calendar!$A$34:$G$459,4,FALSE))))","v":"R"},{"$f":"IF(Summary!$B$5=3,IF(C29=\"\",\"\",VLOOKUP(A29,Calendar!$A$34:$G$459,5,FALSE)),IF(C29=\"\",\"\",VLOOKUP(A29,Calendar!$A$34:$G$459,2,FALSE)))","v":"2020-05-21"},null,null,null,null,0,null,null,""]
[522,null,{"$f":"IF(ISNA(IF(Summary!$B$5=3,IF(VLOOKUP(A30,Calendar!$A$34:$G$459,7,FALSE)=\"S\", \"\", VLOOKUP(A30,Calendar!$A$34:$G$459,7,FALSE)),IF(VLOOKUP(A30,Calendar!$A$34:$G$459,4,FALSE)=\"S\", \"\", VLOOKUP(A30,Calendar!$A$34:$G$459,4,FALSE)))),\"\",IF(Summary!$B$5=3,IF(VLOOKUP(A30,Calendar!$A$34:$G$459,7,FALSE)=\"S\", \"\", VLOOKUP(A30,Calendar!$A$34:$G$459,7,FALSE)),IF(VLOOKUP(A30,Calendar!$A$34:$G$459,4,FALSE)=\"S\", \"\", VLOOKUP(A30,Calendar!$A$34:$G$459,4,FALSE))))","v":"F"},{"$f":"IF(Summary!$B$5=3,IF(C30=\"\",\"\",VLOOKUP(A30,Calendar!$A$34:$G$459,5,FALSE)),IF(C30=\"\",\"\",VLOOKUP(A30,Calendar!$A$34:$G$459,2,FALSE)))","v":"2020-05-22"},null,null,null,null,0,null,null,""]
[523,null,{"$f":"IF(ISNA(IF(Summary!$B$5=3,IF(VLOOKUP(A31,Calendar!$A$34:$G$459,7,FALSE)=\"S\", \"\", VLOOKUP(A31,Calendar!$A$34:$G$459,7,FALSE)),IF(VLOOKUP(A31,Calendar!$A$34:$G$459,4,FALSE)=\"S\", \"\", VLOOKUP(A31,Calendar!$A$34:$G$459,4,FALSE)))),\"\",IF(Summary!$B$5=3,IF(VLOOKUP(A31,Calendar!$A$34:$G$459,7,FALSE)=\"S\", \"\", VLOOKUP(A31,Calendar!$A$34:$G$459,7,FALSE)),IF(VLOOKUP(A31,Calendar!$A$34:$G$459,4,FALSE)=\"S\", \"\", VLOOKUP(A31,Calendar!$A$34:$G$459,4,FALSE))))","v":""},{"$f":"IF(Summary!$B$5=3,IF(C31=\"\",\"\",VLOOKUP(A31,Calendar!$A$34:$G$459,5,FALSE)),IF(C31=\"\",\"\",VLOOKUP(A31,Calendar!$A$34:$G$459,2,FALSE)))","v":""},null,null,null,null,0,null,null,""]
[524,null,{"$f":"IF(ISNA(IF(Summary!$B$5=3,IF(VLOOKUP(A32,Calendar!$A$34:$G$459,7,FALSE)=\"S\", \"\", VLOOKUP(A32,Calendar!$A$34:$G$459,7,FALSE)),IF(VLOOKUP(A32,Calendar!$A$34:$G$459,4,FALSE)=\"S\", \"\", VLOOKUP(A32,Calendar!$A$34:$G$459,4,FALSE)))),\"\",IF(Summary!$B$5=3,IF(VLOOKUP(A32,Calendar!$A$34:$G$459,7,FALSE)=\"S\", \"\", VLOOKUP(A32,Calendar!$A$34:$G$459,7,FALSE)),IF(VLOOKUP(A32,Calendar!$A$34:$G$459,4,FALSE)=\"S\", \"\", VLOOKUP(A32,Calendar!$A$34:$G$459,4,FALSE))))","v":""},{"$f":"IF(Summary!$B$5=3,IF(C32=\"\",\"\",VLOOKUP(A32,Calendar!$A$34:$G$459,5,FALSE)),IF(C32=\"\",\"\",VLOOKUP(A32,Calendar!$A$34:$G$459,2,FALSE)))","v":""},null,null,null,null,0,null,null,""]
[525,null,{"$f":"IF(ISNA(IF(Summary!$B$5=3,IF(VLOOKUP(A33,Calendar!$A$34:$G$459,7,FALSE)=\"S\", \"\", VLOOKUP(A33,Calendar!$A$34:$G$459,7,FALSE)),IF(VLOOKUP(A33,Calendar!$A$34:$G$459,4,FALSE)=\"S\", \"\", VLOOKUP(A33,Calendar!$A$34:$G$459,4,FALSE)))),\"\",IF(Summary!$B$5=3,IF(VLOOKUP(A33,Calendar!$A$34:$G$459,7,FALSE)=\"S\", \"\", VLOOKUP(A33,Calendar!$A$34:$G$459,7,FALSE)),IF(VLOOKUP(A33,Calendar!$A$34:$G$459,4,FALSE)=\"S\", \"\", VLOOKUP(A33,Calendar!$A$34:$G$459,4,FALSE))))","v":"M"},{"$f":"IF(Summary!$B$5=3,IF(C33=\"\",\"\",VLOOKUP(A33,Calendar!$A$34:$G$459,5,FALSE)),IF(C33=\"\",\"\",VLOOKUP(A33,Calendar!$A$34:$G$459,2,FALSE)))","v":"2020-05-25"},null,null,null,null,0,null,null,""]
[526,null,{"$f":"IF(ISNA(IF(Summary!$B$5=3,IF(VLOOKUP(A34,Calendar!$A$34:$G$459,7,FALSE)=\"S\", \"\", VLOOKUP(A34,Calendar!$A$34:$G$459,7,FALSE)),IF(VLOOKUP(A34,Calendar!$A$34:$G$459,4,FALSE)=\"S\", \"\", VLOOKUP(A34,Calendar!$A$34:$G$459,4,FALSE)))),\"\",IF(Summary!$B$5=3,IF(VLOOKUP(A34,Calendar!$A$34:$G$459,7,FALSE)=\"S\", \"\", VLOOKUP(A34,Calendar!$A$34:$G$459,7,FALSE)),IF(VLOOKUP(A34,Calendar!$A$34:$G$459,4,FALSE)=\"S\", \"\", VLOOKUP(A34,Calendar!$A$34:$G$459,4,FALSE))))","v":"T"},{"$f":"IF(Summary!$B$5=3,IF(C34=\"\",\"\",VLOOKUP(A34,Calendar!$A$34:$G$459,5,FALSE)),IF(C34=\"\",\"\",VLOOKUP(A34,Calendar!$A$34:$G$459,2,FALSE)))","v":"2020-05-26"},null,null,null,null,0,null,null,""]
[527,null,{"$f":"IF(ISNA(IF(Summary!$B$5=3,IF(VLOOKUP(A35,Calendar!$A$34:$G$459,7,FALSE)=\"S\", \"\", VLOOKUP(A35,Calendar!$A$34:$G$459,7,FALSE)),IF(VLOOKUP(A35,Calendar!$A$34:$G$459,4,FALSE)=\"S\", \"\", VLOOKUP(A35,Calendar!$A$34:$G$459,4,FALSE)))),\"\",IF(Summary!$B$5=3,IF(VLOOKUP(A35,Calendar!$A$34:$G$459,7,FALSE)=\"S\", \"\", VLOOKUP(A35,Calendar!$A$34:$G$459,7,FALSE)),IF(VLOOKUP(A35,Calendar!$A$34:$G$459,4,FALSE)=\"S\", \"\", VLOOKUP(A35,Calendar!$A$34:$G$459,4,FALSE))))","v":"W"},{"$f":"IF(Summary!$B$5=3,IF(C35=\"\",\"\",VLOOKUP(A35,Calendar!$A$34:$G$459,5,FALSE)),IF(C35=\"\",\"\",VLOOKUP(A35,Calendar!$A$34:$G$459,2,FALSE)))","v":"2020-05-27"},null,null,null,null,0,null,null,""]
[528,null,{"$f":"IF(ISNA(IF(Summary!$B$5=3,IF(VLOOKUP(A36,Calendar!$A$34:$G$459,7,FALSE)=\"S\", \"\", VLOOKUP(A36,Calendar!$A$34:$G$459,7,FALSE)),IF(VLOOKUP(A36,Calendar!$A$34:$G$459,4,FALSE)=\"S\", \"\", VLOOKUP(A36,Calendar!$A$34:$G$459,4,FALSE)))),\"\",IF(Summary!$B$5=3,IF(VLOOKUP(A36,Calendar!$A$34:$G$459,7,FALSE)=\"S\", \"\", VLOOKUP(A36,Calendar!$A$34:$G$459,7,FALSE)),IF(VLOOKUP(A36,Calendar!$A$34:$G$459,4,FALSE)=\"S\", \"\", VLOOKUP(A36,Calendar!$A$34:$G$459,4,FALSE))))","v":"R"},{"$f":"IF(Summary!$B$5=3,IF(C36=\"\",\"\",VLOOKUP(A36,Calendar!$A$34:$G$459,5,FALSE)),IF(C36=\"\",\"\",VLOOKUP(A36,Calendar!$A$34:$G$459,2,FALSE)))","v":"2020-05-28"},null,null,null,null,0,null,null,""]
[529,null,{"$f":"IF(ISNA(IF(Summary!$B$5=3,IF(VLOOKUP(A37,Calendar!$A$34:$G$459,7,FALSE)=\"S\", \"\", VLOOKUP(A37,Calendar!$A$34:$G$459,7,FALSE)),IF(VLOOKUP(A37,Calendar!$A$34:$G$459,4,FALSE)=\"S\", \"\", VLOOKUP(A37,Calendar!$A$34:$G$459,4,FALSE)))),\"\",IF(Summary!$B$5=3,IF(VLOOKUP(A37,Calendar!$A$34:$G$459,7,FALSE)=\"S\", \"\", VLOOKUP(A37,Calendar!$A$34:$G$459,7,FALSE)),IF(VLOOKUP(A37,Calendar!$A$34:$G$459,4,FALSE)=\"S\", \"\", VLOOKUP(A37,Calendar!$A$34:$G$459,4,FALSE))))","v":"F"},{"$f":"IF(Summary!$B$5=3,IF(C37=\"\",\"\",VLOOKUP(A37,Calendar!$A$34:$G$459,5,FALSE)),IF(C37=\"\",\"\",VLOOKUP(A37,Calendar!$A$34:$G$459,2,FALSE)))","v":"2020-05-29"},null,null,null,null,0,null,null,""]
[530,null,{"$f":"IF(ISNA(IF(Summary!$B$5=3,IF(VLOOKUP(A38,Calendar!$A$34:$G$459,7,FALSE)=\"S\", \"\", VLOOKUP(A38,Calendar!$A$34:$G$459,7,FALSE)),IF(VLOOKUP(A38,Calendar!$A$34:$G$459,4,FALSE)=\"S\", \"\", VLOOKUP(A38,Calendar!$A$34:$G$459,4,FALSE)))),\"\",IF(Summary!$B$5=3,IF(VLOOKUP(A38,Calendar!$A$34:$G$459,7,FALSE)=\"S\", \"\", VLOOKUP(A38,Calendar!$A$34:$G$459,7,FALSE)),IF(VLOOKUP(A38,Calendar!$A$34:$G$459,4,FALSE)=\"S\", \"\", VLOOKUP(A38,Calendar!$A$34:$G$459,4,FALSE))))","v":""},{"$f":"IF(Summary!$B$5=3,IF(C38=\"\",\"\",VLOOKUP(A38,Calendar!$A$34:$G$459,5,FALSE)),IF(C38=\"\",\"\",VLOOKUP(A38,Calendar!$A$34:$G$459,2,FALSE)))","v":""},null,null,null,null,0,null,null,""]
[531,null,{"$f":"IF(ISNA(IF(Summary!$B$5=3,IF(VLOOKUP(A39,Calendar!$A$34:$G$459,7,FALSE)=\"S\", \"\", VLOOKUP(A39,Calendar!$A$34:$G$459,7,FALSE)),IF(VLOOKUP(A39,Calendar!$A$34:$G$459,4,FALSE)=\"S\", \"\", VLOOKUP(A39,Calendar!$A$34:$G$459,4,FALSE)))),\"\",IF(Summary!$B$5=3,IF(VLOOKUP(A39,Calendar!$A$34:$G$459,7,FALSE)=\"S\", \"\", VLOOKUP(A39,Calendar!$A$34:$G$459,7,FALSE)),IF(VLOOKUP(A39,Calendar!$A$34:$G$459,4,FALSE)=\"S\", \"\", VLOOKUP(A39,Calendar!$A$34:$G$459,4,FALSE))))","v":""},{"$f":"IF(Summary!$B$5=3,IF(C39=\"\",\"\",VLOOKUP(A39,Calendar!$A$34:$G$459,5,FALSE)),IF(C39=\"\",\"\",VLOOKUP(A39,Calendar!$A$34:$G$459,2,FALSE)))","v":""},null,null,null,null,0,null,null,""]
[null,null,null,"Total Minutes",{"$f":"SUM(E9:E39)","v":0},{"$f":"SUM(F9:F39)","v":0},0,0,0,null,null,{"$f":"IF(SUM(E40:H40)>COUNTA(E9:E39)*390,\"The sum total for all cost objectives exceeds the maximum anticipated value based upon the number of days worked. Confirm minutes claimed for each day.\",\"\")","v":""}]
[null,null,null,"Total Hours",{"$f":"E40/60","v":0},{"$f":"F40/60","v":0},0,0,0]
[]
[]
[null,null,"Notes"]
[]
[]
[]
[]
[]
[]
[]
[]
[]
[]
[]
[null,null,null,null,"Kansas State Department of Education",null,null,null,"Personnel Activity Report"]
[null,null,null,null,"Fiscal Auditing",null,null,null,"Updated 9/20/18"]
[null,null,null,null,"785-296-4976"]
[null,null,null,null,"https://www.ksde.org/Agency/Fiscal-and-Administrative-Services/Fiscal-Auditing"]
[]
[]
[null,null,"The Kansas State Department of Education does not discriminate on the basis of race, color, national origin, sex, disability, or age in its programs and activities and provides equal access to the Boy Scouts and other designated youth groups. The following person has been designated to handle inquiries regarding the nondiscrimination policies: KSDE General Counsel, Office of General Counsel, KSDE, Landon State Office Building, 900 S.W. Jackson, Suite 102, Topeka, KS 66612, (785) 296-3204."]

{"sheet":"June","index":13,"n_rows":61,"n_cols":12,"rows_kept":61,"cut":false,"hidden":false,"merged":[[60,2,61,8],[1,2,1,8],[2,2,2,8],[3,2,3,8],[4,2,4,8],[46,2,46,8],[47,2,47,8],[48,2,48,8],[49,2,49,8],[5,2,5,8],[6,2,6,8],[43,3,43,8],[44,2,44,8],[45,2,45,8]]}
[]
[]
[null,null,"Personnel Activity Report"]
[null,null,"Regular School Year"]
[null,null,"June"]
[null,null,{"$f":"IF(Summary!$E$8<>\"\",Summary!$E$8,\" \")","v":" "}]
[null,null,{"$f":"IF(Summary!$E$9<>\"\",Summary!$E$9,\" \")","v":" "}]
[null,null,"Day","Date","Special Ed","General Ed","Other","Other","Totals",null,null,{"$f":"IF(OR(AND(F8=\"\",COUNTA(F9:F39)>0),AND(G8=\"\",COUNTA(G9:G39)>0),AND(H8=\"\",COUNTA(H9:H39)>0)),\"<<< You must identify the cost objective in the column heading.\",\"\")","v":""}]
[601,null,{"$f":"IF(ISNA(IF(Summary!$B$5=3,IF(VLOOKUP(A9,Calendar!$A$64:$G$459,7,FALSE)=\"S\", \"\", VLOOKUP(A9,Calendar!$A$64:$G$459,7,FALSE)),IF(VLOOKUP(A9,Calendar!$A$64:$G$459,4,FALSE)=\"S\", \"\", VLOOKUP(A9,Calendar!$A$64:$G$459,4,FALSE)))),\"\",IF(Summary!$B$5=3,IF(VLOOKUP(A9,Calendar!$A$64:$G$459,7,FALSE)=\"S\", \"\", VLOOKUP(A9,Calendar!$A$64:$G$459,7,FALSE)),IF(VLOOKUP(A9,Calendar!$A$64:$G$459,4,FALSE)=\"S\", \"\", VLOOKUP(A9,Calendar!$A$64:$G$459,4,FALSE))))","v":"M"},{"$f":"IF(Summary!$B$5=3,IF(C9=\"\",\"\",VLOOKUP(A9,Calendar!$A$64:$G$459,5,FALSE)),IF(C9=\"\",\"\",VLOOKUP(A9,Calendar!$A$64:$G$459,2,FALSE)))","v":"2020-06-01"},null,null,null,null,{"$f":"MIN(1440,SUM(E9:H9))","v":0},null,null,{"$f":"IF(I9>390, \"<<< Day exceeds 390 minutes. Confirm reported time.\",\"\")","v":""}]
[602,null,{"$f":"IF(ISNA(IF(Summary!$B$5=3,IF(VLOOKUP(A10,Calendar!$A$64:$G$459,7,FALSE)=\"S\", \"\", VLOOKUP(A10,Calendar!$A$64:$G$459,7,FALSE)),IF(VLOOKUP(A10,Calendar!$A$64:$G$459,4,FALSE)=\"S\", \"\", VLOOKUP(A10,Calendar!$A$64:$G$459,4,FALSE)))),\"\",IF(Summary!$B$5=3,IF(VLOOKUP(A10,Calendar!$A$64:$G$459,7,FALSE)=\"S\", \"\", VLOOKUP(A10,Calendar!$A$64:$G$459,7,FALSE)),IF(VLOOKUP(A10,Calendar!$A$64:$G$459,4,FALSE)=\"S\", \"\", VLOOKUP(A10,Calendar!$A$64:$G$459,4,FALSE))))","v":"T"},{"$f":"IF(Summary!$B$5=3,IF(C10=\"\",\"\",VLOOKUP(A10,Calendar!$A$64:$G$459,5,FALSE)),IF(C10=\"\",\"\",VLOOKUP(A10,Calendar!$A$64:$G$459,2,FALSE)))","v":"2020-06-02"},null,null,null,null,{"$f":"MIN(1440,SUM(E10:H10))","v":0},null,null,{"$f":"IF(I10>390, \"<<< Day exceeds 390 minutes. Confirm reported time.\",\"\")","v":""}]
[603,null,{"$f":"IF(ISNA(IF(Summary!$B$5=3,IF(VLOOKUP(A11,Calendar!$A$64:$G$459,7,FALSE)=\"S\", \"\", VLOOKUP(A11,Calendar!$A$64:$G$459,7,FALSE)),IF(VLOOKUP(A11,Calendar!$A$64:$G$459,4,FALSE)=\"S\", \"\", VLOOKUP(A11,Calendar!$A$64:$G$459,4,FALSE)))),\"\",IF(Summary!$B$5=3,IF(VLOOKUP(A11,Calendar!$A$64:$G$459,7,FALSE)=\"S\", \"\", VLOOKUP(A11,Calendar!$A$64:$G$459,7,FALSE)),IF(VLOOKUP(A11,Calendar!$A$64:$G$459,4,FALSE)=\"S\", \"\", VLOOKUP(A11,Calendar!$A$64:$G$459,4,FALSE))))","v":"W"},{"$f":"IF(Summary!$B$5=3,IF(C11=\"\",\"\",VLOOKUP(A11,Calendar!$A$64:$G$459,5,FALSE)),IF(C11=\"\",\"\",VLOOKUP(A11,Calendar!$A$64:$G$459,2,FALSE)))","v":"2020-06-03"},null,null,null,null,0,null,null,""]
[604,null,{"$f":"IF(ISNA(IF(Summary!$B$5=3,IF(VLOOKUP(A12,Calendar!$A$64:$G$459,7,FALSE)=\"S\", \"\", VLOOKUP(A12,Calendar!$A$64:$G$459,7,FALSE)),IF(VLOOKUP(A12,Calendar!$A$64:$G$459,4,FALSE)=\"S\", \"\", VLOOKUP(A12,Calendar!$A$64:$G$459,4,FALSE)))),\"\",IF(Summary!$B$5=3,IF(VLOOKUP(A12,Calendar!$A$64:$G$459,7,FALSE)=\"S\", \"\", VLOOKUP(A12,Calendar!$A$64:$G$459,7,FALSE)),IF(VLOOKUP(A12,Calendar!$A$64:$G$459,4,FALSE)=\"S\", \"\", VLOOKUP(A12,Calendar!$A$64:$G$459,4,FALSE))))","v":"R"},{"$f":"IF(Summary!$B$5=3,IF(C12=\"\",\"\",VLOOKUP(A12,Calendar!$A$64:$G$459,5,FALSE)),IF(C12=\"\",\"\",VLOOKUP(A12,Calendar!$A$64:$G$459,2,FALSE)))","v":"2020-06-04"},null,null,null,null,0,null,null,""]
[605,null,{"$f":"IF(ISNA(IF(Summary!$B$5=3,IF(VLOOKUP(A13,Calendar!$A$64:$G$459,7,FALSE)=\"S\", \"\", VLOOKUP(A13,Calendar!$A$64:$G$459,7,FALSE)),IF(VLOOKUP(A13,Calendar!$A$64:$G$459,4,FALSE)=\"S\", \"\", VLOOKUP(A13,Calendar!$A$64:$G$459,4,FALSE)))),\"\",IF(Summary!$B$5=3,IF(VLOOKUP(A13,Calendar!$A$64:$G$459,7,FALSE)=\"S\", \"\", VLOOKUP(A13,Calendar!$A$64:$G$459,7,FALSE)),IF(VLOOKUP(A13,Calendar!$A$64:$G$459,4,FALSE)=\"S\", \"\", VLOOKUP(A13,Calendar!$A$64:$G$459,4,FALSE))))","v":"F"},{"$f":"IF(Summary!$B$5=3,IF(C13=\"\",\"\",VLOOKUP(A13,Calendar!$A$64:$G$459,5,FALSE)),IF(C13=\"\",\"\",VLOOKUP(A13,Calendar!$A$64:$G$459,2,FALSE)))","v":"2020-06-05"},null,null,null,null,0,null,null,""]
[606,null,{"$f":"IF(ISNA(IF(Summary!$B$5=3,IF(VLOOKUP(A14,Calendar!$A$64:$G$459,7,FALSE)=\"S\", \"\", VLOOKUP(A14,Calendar!$A$64:$G$459,7,FALSE)),IF(VLOOKUP(A14,Calendar!$A$64:$G$459,4,FALSE)=\"S\", \"\", VLOOKUP(A14,Calendar!$A$64:$G$459,4,FALSE)))),\"\",IF(Summary!$B$5=3,IF(VLOOKUP(A14,Calendar!$A$64:$G$459,7,FALSE)=\"S\", \"\", VLOOKUP(A14,Calendar!$A$64:$G$459,7,FALSE)),IF(VLOOKUP(A14,Calendar!$A$64:$G$459,4,FALSE)=\"S\", \"\", VLOOKUP(A14,Calendar!$A$64:$G$459,4,FALSE))))","v":""},{"$f":"IF(Summary!$B$5=3,IF(C14=\"\",\"\",VLOOKUP(A14,Calendar!$A$64:$G$459,5,FALSE)),IF(C14=\"\",\"\",VLOOKUP(A14,Calendar!$A$64:$G$459,2,FALSE)))","v":""},null,null,null,null,0,null,null,""]
[607,null,{"$f":"IF(ISNA(IF(Summary!$B$5=3,IF(VLOOKUP(A15,Calendar!$A$64:$G$459,7,FALSE)=\"S\", \"\", VLOOKUP(A15,Calendar!$A$64:$G$459,7,FALSE)),IF(VLOOKUP(A15,Calendar!$A$64:$G$459,4,FALSE)=\"S\", \"\", VLOOKUP(A15,Calendar!$A$64:$G$459,4,FALSE)))),\"\",IF(Summary!$B$5=3,IF(VLOOKUP(A15,Calendar!$A$64:$G$459,7,FALSE)=\"S\", \"\", VLOOKUP(A15,Calendar!$A$64:$G$459,7,FALSE)),IF(VLOOKUP(A15,Calendar!$A$64:$G$459,4,FALSE)=\"S\", \"\", VLOOKUP(A15,Calendar!$A$64:$G$459,4,FALSE))))","v":""},{"$f":"IF(Summary!$B$5=3,IF(C15=\"\",\"\",VLOOKUP(A15,Calendar!$A$64:$G$459,5,FALSE)),IF(C15=\"\",\"\",VLOOKUP(A15,Calendar!$A$64:$G$459,2,FALSE)))","v":""},null,null,null,null,0,null,null,""]
[608,null,{"$f":"IF(ISNA(IF(Summary!$B$5=3,IF(VLOOKUP(A16,Calendar!$A$64:$G$459,7,FALSE)=\"S\", \"\", VLOOKUP(A16,Calendar!$A$64:$G$459,7,FALSE)),IF(VLOOKUP(A16,Calendar!$A$64:$G$459,4,FALSE)=\"S\", \"\", VLOOKUP(A16,Calendar!$A$64:$G$459,4,FALSE)))),\"\",IF(Summary!$B$5=3,IF(VLOOKUP(A16,Calendar!$A$64:$G$459,7,FALSE)=\"S\", \"\", VLOOKUP(A16,Calendar!$A$64:$G$459,7,FALSE)),IF(VLOOKUP(A16,Calendar!$A$64:$G$459,4,FALSE)=\"S\", \"\", VLOOKUP(A16,Calendar!$A$64:$G$459,4,FALSE))))","v":"M"},{"$f":"IF(Summary!$B$5=3,IF(C16=\"\",\"\",VLOOKUP(A16,Calendar!$A$64:$G$459,5,FALSE)),IF(C16=\"\",\"\",VLOOKUP(A16,Calendar!$A$64:$G$459,2,FALSE)))","v":"2020-06-08"},null,null,null,null,0,null,null,""]
[609,null,{"$f":"IF(ISNA(IF(Summary!$B$5=3,IF(VLOOKUP(A17,Calendar!$A$64:$G$459,7,FALSE)=\"S\", \"\", VLOOKUP(A17,Calendar!$A$64:$G$459,7,FALSE)),IF(VLOOKUP(A17,Calendar!$A$64:$G$459,4,FALSE)=\"S\", \"\", VLOOKUP(A17,Calendar!$A$64:$G$459,4,FALSE)))),\"\",IF(Summary!$B$5=3,IF(VLOOKUP(A17,Calendar!$A$64:$G$459,7,FALSE)=\"S\", \"\", VLOOKUP(A17,Calendar!$A$64:$G$459,7,FALSE)),IF(VLOOKUP(A17,Calendar!$A$64:$G$459,4,FALSE)=\"S\", \"\", VLOOKUP(A17,Calendar!$A$64:$G$459,4,FALSE))))","v":"T"},{"$f":"IF(Summary!$B$5=3,IF(C17=\"\",\"\",VLOOKUP(A17,Calendar!$A$64:$G$459,5,FALSE)),IF(C17=\"\",\"\",VLOOKUP(A17,Calendar!$A$64:$G$459,2,FALSE)))","v":"2020-06-09"},null,null,null,null,0,null,null,""]
[610,null,{"$f":"IF(ISNA(IF(Summary!$B$5=3,IF(VLOOKUP(A18,Calendar!$A$64:$G$459,7,FALSE)=\"S\", \"\", VLOOKUP(A18,Calendar!$A$64:$G$459,7,FALSE)),IF(VLOOKUP(A18,Calendar!$A$64:$G$459,4,FALSE)=\"S\", \"\", VLOOKUP(A18,Calendar!$A$64:$G$459,4,FALSE)))),\"\",IF(Summary!$B$5=3,IF(VLOOKUP(A18,Calendar!$A$64:$G$459,7,FALSE)=\"S\", \"\", VLOOKUP(A18,Calendar!$A$64:$G$459,7,FALSE)),IF(VLOOKUP(A18,Calendar!$A$64:$G$459,4,FALSE)=\"S\", \"\", VLOOKUP(A18,Calendar!$A$64:$G$459,4,FALSE))))","v":"W"},{"$f":"IF(Summary!$B$5=3,IF(C18=\"\",\"\",VLOOKUP(A18,Calendar!$A$64:$G$459,5,FALSE)),IF(C18=\"\",\"\",VLOOKUP(A18,Calendar!$A$64:$G$459,2,FALSE)))","v":"2020-06-10"},null,null,null,null,0,null,null,""]
[611,null,{"$f":"IF(ISNA(IF(Summary!$B$5=3,IF(VLOOKUP(A19,Calendar!$A$64:$G$459,7,FALSE)=\"S\", \"\", VLOOKUP(A19,Calendar!$A$64:$G$459,7,FALSE)),IF(VLOOKUP(A19,Calendar!$A$64:$G$459,4,FALSE)=\"S\", \"\", VLOOKUP(A19,Calendar!$A$64:$G$459,4,FALSE)))),\"\",IF(Summary!$B$5=3,IF(VLOOKUP(A19,Calendar!$A$64:$G$459,7,FALSE)=\"S\", \"\", VLOOKUP(A19,Calendar!$A$64:$G$459,7,FALSE)),IF(VLOOKUP(A19,Calendar!$A$64:$G$459,4,FALSE)=\"S\", \"\", VLOOKUP(A19,Calendar!$A$64:$G$459,4,FALSE))))","v":"R"},{"$f":"IF(Summary!$B$5=3,IF(C19=\"\",\"\",VLOOKUP(A19,Calendar!$A$64:$G$459,5,FALSE)),IF(C19=\"\",\"\",VLOOKUP(A19,Calendar!$A$64:$G$459,2,FALSE)))","v":"2020-06-11"},null,null,null,null,0,null,null,""]
[612,null,{"$f":"IF(ISNA(IF(Summary!$B$5=3,IF(VLOOKUP(A20,Calendar!$A$64:$G$459,7,FALSE)=\"S\", \"\", VLOOKUP(A20,Calendar!$A$64:$G$459,7,FALSE)),IF(VLOOKUP(A20,Calendar!$A$64:$G$459,4,FALSE)=\"S\", \"\", VLOOKUP(A20,Calendar!$A$64:$G$459,4,FALSE)))),\"\",IF(Summary!$B$5=3,IF(VLOOKUP(A20,Calendar!$A$64:$G$459,7,FALSE)=\"S\", \"\", VLOOKUP(A20,Calendar!$A$64:$G$459,7,FALSE)),IF(VLOOKUP(A20,Calendar!$A$64:$G$459,4,FALSE)=\"S\", \"\", VLOOKUP(A20,Calendar!$A$64:$G$459,4,FALSE))))","v":"F"},{"$f":"IF(Summary!$B$5=3,IF(C20=\"\",\"\",VLOOKUP(A20,Calendar!$A$64:$G$459,5,FALSE)),IF(C20=\"\",\"\",VLOOKUP(A20,Calendar!$A$64:$G$459,2,FALSE)))","v":"2020-06-12"},null,null,null,null,0,null,null,""]
[613,null,{"$f":"IF(ISNA(IF(Summary!$B$5=3,IF(VLOOKUP(A21,Calendar!$A$64:$G$459,7,FALSE)=\"S\", \"\", VLOOKUP(A21,Calendar!$A$64:$G$459,7,FALSE)),IF(VLOOKUP(A21,Calendar!$A$64:$G$459,4,FALSE)=\"S\", \"\", VLOOKUP(A21,Calendar!$A$64:$G$459,4,FALSE)))),\"\",IF(Summary!$B$5=3,IF(VLOOKUP(A21,Calendar!$A$64:$G$459,7,FALSE)=\"S\", \"\", VLOOKUP(A21,Calendar!$A$64:$G$459,7,FALSE)),IF(VLOOKUP(A21,Calendar!$A$64:$G$459,4,FALSE)=\"S\", \"\", VLOOKUP(A21,Calendar!$A$64:$G$459,4,FALSE))))","v":""},{"$f":"IF(Summary!$B$5=3,IF(C21=\"\",\"\",VLOOKUP(A21,Calendar!$A$64:$G$459,5,FALSE)),IF(C21=\"\",\"\",VLOOKUP(A21,Calendar!$A$64:$G$459,2,FALSE)))","v":""},null,null,null,null,0,null,null,""]
[614,null,{"$f":"IF(ISNA(IF(Summary!$B$5=3,IF(VLOOKUP(A22,Calendar!$A$64:$G$459,7,FALSE)=\"S\", \"\", VLOOKUP(A22,Calendar!$A$64:$G$459,7,FALSE)),IF(VLOOKUP(A22,Calendar!$A$64:$G$459,4,FALSE)=\"S\", \"\", VLOOKUP(A22,Calendar!$A$64:$G$459,4,FALSE)))),\"\",IF(Summary!$B$5=3,IF(VLOOKUP(A22,Calendar!$A$64:$G$459,7,FALSE)=\"S\", \"\", VLOOKUP(A22,Calendar!$A$64:$G$459,7,FALSE)),IF(VLOOKUP(A22,Calendar!$A$64:$G$459,4,FALSE)=\"S\", \"\", VLOOKUP(A22,Calendar!$A$64:$G$459,4,FALSE))))","v":""},{"$f":"IF(Summary!$B$5=3,IF(C22=\"\",\"\",VLOOKUP(A22,Calendar!$A$64:$G$459,5,FALSE)),IF(C22=\"\",\"\",VLOOKUP(A22,Calendar!$A$64:$G$459,2,FALSE)))","v":""},null,null,null,null,0,null,null,""]
[615,null,{"$f":"IF(ISNA(IF(Summary!$B$5=3,IF(VLOOKUP(A23,Calendar!$A$64:$G$459,7,FALSE)=\"S\", \"\", VLOOKUP(A23,Calendar!$A$64:$G$459,7,FALSE)),IF(VLOOKUP(A23,Calendar!$A$64:$G$459,4,FALSE)=\"S\", \"\", VLOOKUP(A23,Calendar!$A$64:$G$459,4,FALSE)))),\"\",IF(Summary!$B$5=3,IF(VLOOKUP(A23,Calendar!$A$64:$G$459,7,FALSE)=\"S\", \"\", VLOOKUP(A23,Calendar!$A$64:$G$459,7,FALSE)),IF(VLOOKUP(A23,Calendar!$A$64:$G$459,4,FALSE)=\"S\", \"\", VLOOKUP(A23,Calendar!$A$64:$G$459,4,FALSE))))","v":"M"},{"$f":"IF(Summary!$B$5=3,IF(C23=\"\",\"\",VLOOKUP(A23,Calendar!$A$64:$G$459,5,FALSE)),IF(C23=\"\",\"\",VLOOKUP(A23,Calendar!$A$64:$G$459,2,FALSE)))","v":"2020-06-15"},null,null,null,null,0,null,null,""]
[616,null,{"$f":"IF(ISNA(IF(Summary!$B$5=3,IF(VLOOKUP(A24,Calendar!$A$64:$G$459,7,FALSE)=\"S\", \"\", VLOOKUP(A24,Calendar!$A$64:$G$459,7,FALSE)),IF(VLOOKUP(A24,Calendar!$A$64:$G$459,4,FALSE)=\"S\", \"\", VLOOKUP(A24,Calendar!$A$64:$G$459,4,FALSE)))),\"\",IF(Summary!$B$5=3,IF(VLOOKUP(A24,Calendar!$A$64:$G$459,7,FALSE)=\"S\", \"\", VLOOKUP(A24,Calendar!$A$64:$G$459,7,FALSE)),IF(VLOOKUP(A24,Calendar!$A$64:$G$459,4,FALSE)=\"S\", \"\", VLOOKUP(A24,Calendar!$A$64:$G$459,4,FALSE))))","v":"T"},{"$f":"IF(Summary!$B$5=3,IF(C24=\"\",\"\",VLOOKUP(A24,Calendar!$A$64:$G$459,5,FALSE)),IF(C24=\"\",\"\",VLOOKUP(A24,Calendar!$A$64:$G$459,2,FALSE)))","v":"2020-06-16"},null,null,null,null,0,null,null,""]
[617,null,{"$f":"IF(ISNA(IF(Summary!$B$5=3,IF(VLOOKUP(A25,Calendar!$A$64:$G$459,7,FALSE)=\"S\", \"\", VLOOKUP(A25,Calendar!$A$64:$G$459,7,FALSE)),IF(VLOOKUP(A25,Calendar!$A$64:$G$459,4,FALSE)=\"S\", \"\", VLOOKUP(A25,Calendar!$A$64:$G$459,4,FALSE)))),\"\",IF(Summary!$B$5=3,IF(VLOOKUP(A25,Calendar!$A$64:$G$459,7,FALSE)=\"S\", \"\", VLOOKUP(A25,Calendar!$A$64:$G$459,7,FALSE)),IF(VLOOKUP(A25,Calendar!$A$64:$G$459,4,FALSE)=\"S\", \"\", VLOOKUP(A25,Calendar!$A$64:$G$459,4,FALSE))))","v":"W"},{"$f":"IF(Summary!$B$5=3,IF(C25=\"\",\"\",VLOOKUP(A25,Calendar!$A$64:$G$459,5,FALSE)),IF(C25=\"\",\"\",VLOOKUP(A25,Calendar!$A$64:$G$459,2,FALSE)))","v":"2020-06-17"},null,null,null,null,0,null,null,""]
[618,null,{"$f":"IF(ISNA(IF(Summary!$B$5=3,IF(VLOOKUP(A26,Calendar!$A$64:$G$459,7,FALSE)=\"S\", \"\", VLOOKUP(A26,Calendar!$A$64:$G$459,7,FALSE)),IF(VLOOKUP(A26,Calendar!$A$64:$G$459,4,FALSE)=\"S\", \"\", VLOOKUP(A26,Calendar!$A$64:$G$459,4,FALSE)))),\"\",IF(Summary!$B$5=3,IF(VLOOKUP(A26,Calendar!$A$64:$G$459,7,FALSE)=\"S\", \"\", VLOOKUP(A26,Calendar!$A$64:$G$459,7,FALSE)),IF(VLOOKUP(A26,Calendar!$A$64:$G$459,4,FALSE)=\"S\", \"\", VLOOKUP(A26,Calendar!$A$64:$G$459,4,FALSE))))","v":"R"},{"$f":"IF(Summary!$B$5=3,IF(C26=\"\",\"\",VLOOKUP(A26,Calendar!$A$64:$G$459,5,FALSE)),IF(C26=\"\",\"\",VLOOKUP(A26,Calendar!$A$64:$G$459,2,FALSE)))","v":"2020-06-18"},null,null,null,null,0,null,null,""]
[619,null,{"$f":"IF(ISNA(IF(Summary!$B$5=3,IF(VLOOKUP(A27,Calendar!$A$64:$G$459,7,FALSE)=\"S\", \"\", VLOOKUP(A27,Calendar!$A$64:$G$459,7,FALSE)),IF(VLOOKUP(A27,Calendar!$A$64:$G$459,4,FALSE)=\"S\", \"\", VLOOKUP(A27,Calendar!$A$64:$G$459,4,FALSE)))),\"\",IF(Summary!$B$5=3,IF(VLOOKUP(A27,Calendar!$A$64:$G$459,7,FALSE)=\"S\", \"\", VLOOKUP(A27,Calendar!$A$64:$G$459,7,FALSE)),IF(VLOOKUP(A27,Calendar!$A$64:$G$459,4,FALSE)=\"S\", \"\", VLOOKUP(A27,Calendar!$A$64:$G$459,4,FALSE))))","v":"F"},{"$f":"IF(Summary!$B$5=3,IF(C27=\"\",\"\",VLOOKUP(A27,Calendar!$A$64:$G$459,5,FALSE)),IF(C27=\"\",\"\",VLOOKUP(A27,Calendar!$A$64:$G$459,2,FALSE)))","v":"2020-06-19"},null,null,null,null,0,null,null,""]
[620,null,{"$f":"IF(ISNA(IF(Summary!$B$5=3,IF(VLOOKUP(A28,Calendar!$A$64:$G$459,7,FALSE)=\"S\", \"\", VLOOKUP(A28,Calendar!$A$64:$G$459,7,FALSE)),IF(VLOOKUP(A28,Calendar!$A$64:$G$459,4,FALSE)=\"S\", \"\", VLOOKUP(A28,Calendar!$A$64:$G$459,4,FALSE)))),\"\",IF(Summary!$B$5=3,IF(VLOOKUP(A28,Calendar!$A$64:$G$459,7,FALSE)=\"S\", \"\", VLOOKUP(A28,Calendar!$A$64:$G$459,7,FALSE)),IF(VLOOKUP(A28,Calendar!$A$64:$G$459,4,FALSE)=\"S\", \"\", VLOOKUP(A28,Calendar!$A$64:$G$459,4,FALSE))))","v":""},{"$f":"IF(Summary!$B$5=3,IF(C28=\"\",\"\",VLOOKUP(A28,Calendar!$A$64:$G$459,5,FALSE)),IF(C28=\"\",\"\",VLOOKUP(A28,Calendar!$A$64:$G$459,2,FALSE)))","v":""},null,null,null,null,0,null,null,""]
[621,null,{"$f":"IF(ISNA(IF(Summary!$B$5=3,IF(VLOOKUP(A29,Calendar!$A$64:$G$459,7,FALSE)=\"S\", \"\", VLOOKUP(A29,Calendar!$A$64:$G$459,7,FALSE)),IF(VLOOKUP(A29,Calendar!$A$64:$G$459,4,FALSE)=\"S\", \"\", VLOOKUP(A29,Calendar!$A$64:$G$459,4,FALSE)))),\"\",IF(Summary!$B$5=3,IF(VLOOKUP(A29,Calendar!$A$64:$G$459,7,FALSE)=\"S\", \"\", VLOOKUP(A29,Calendar!$A$64:$G$459,7,FALSE)),IF(VLOOKUP(A29,Calendar!$A$64:$G$459,4,FALSE)=\"S\", \"\", VLOOKUP(A29,Calendar!$A$64:$G$459,4,FALSE))))","v":""},{"$f":"IF(Summary!$B$5=3,IF(C29=\"\",\"\",VLOOKUP(A29,Calendar!$A$64:$G$459,5,FALSE)),IF(C29=\"\",\"\",VLOOKUP(A29,Calendar!$A$64:$G$459,2,FALSE)))","v":""},null,null,null,null,0,null,null,""]
[622,null,{"$f":"IF(ISNA(IF(Summary!$B$5=3,IF(VLOOKUP(A30,Calendar!$A$64:$G$459,7,FALSE)=\"S\", \"\", VLOOKUP(A30,Calendar!$A$64:$G$459,7,FALSE)),IF(VLOOKUP(A30,Calendar!$A$64:$G$459,4,FALSE)=\"S\", \"\", VLOOKUP(A30,Calendar!$A$64:$G$459,4,FALSE)))),\"\",IF(Summary!$B$5=3,IF(VLOOKUP(A30,Calendar!$A$64:$G$459,7,FALSE)=\"S\", \"\", VLOOKUP(A30,Calendar!$A$64:$G$459,7,FALSE)),IF(VLOOKUP(A30,Calendar!$A$64:$G$459,4,FALSE)=\"S\", \"\", VLOOKUP(A30,Calendar!$A$64:$G$459,4,FALSE))))","v":"M"},{"$f":"IF(Summary!$B$5=3,IF(C30=\"\",\"\",VLOOKUP(A30,Calendar!$A$64:$G$459,5,FALSE)),IF(C30=\"\",\"\",VLOOKUP(A30,Calendar!$A$64:$G$459,2,FALSE)))","v":"2020-06-22"},null,null,null,null,0,null,null,""]
[623,null,{"$f":"IF(ISNA(IF(Summary!$B$5=3,IF(VLOOKUP(A31,Calendar!$A$64:$G$459,7,FALSE)=\"S\", \"\", VLOOKUP(A31,Calendar!$A$64:$G$459,7,FALSE)),IF(VLOOKUP(A31,Calendar!$A$64:$G$459,4,FALSE)=\"S\", \"\", VLOOKUP(A31,Calendar!$A$64:$G$459,4,FALSE)))),\"\",IF(Summary!$B$5=3,IF(VLOOKUP(A31,Calendar!$A$64:$G$459,7,FALSE)=\"S\", \"\", VLOOKUP(A31,Calendar!$A$64:$G$459,7,FALSE)),IF(VLOOKUP(A31,Calendar!$A$64:$G$459,4,FALSE)=\"S\", \"\", VLOOKUP(A31,Calendar!$A$64:$G$459,4,FALSE))))","v":"T"},{"$f":"IF(Summary!$B$5=3,IF(C31=\"\",\"\",VLOOKUP(A31,Calendar!$A$64:$G$459,5,FALSE)),IF(C31=\"\",\"\",VLOOKUP(A31,Calendar!$A$64:$G$459,2,FALSE)))","v":"2020-06-23"},null,null,null,null,0,null,null,""]
[624,null,{"$f":"IF(ISNA(IF(Summary!$B$5=3,IF(VLOOKUP(A32,Calendar!$A$64:$G$459,7,FALSE)=\"S\", \"\", VLOOKUP(A32,Calendar!$A$64:$G$459,7,FALSE)),IF(VLOOKUP(A32,Calendar!$A$64:$G$459,4,FALSE)=\"S\", \"\", VLOOKUP(A32,Calendar!$A$64:$G$459,4,FALSE)))),\"\",IF(Summary!$B$5=3,IF(VLOOKUP(A32,Calendar!$A$64:$G$459,7,FALSE)=\"S\", \"\", VLOOKUP(A32,Calendar!$A$64:$G$459,7,FALSE)),IF(VLOOKUP(A32,Calendar!$A$64:$G$459,4,FALSE)=\"S\", \"\", VLOOKUP(A32,Calendar!$A$64:$G$459,4,FALSE))))","v":"W"},{"$f":"IF(Summary!$B$5=3,IF(C32=\"\",\"\",VLOOKUP(A32,Calendar!$A$64:$G$459,5,FALSE)),IF(C32=\"\",\"\",VLOOKUP(A32,Calendar!$A$64:$G$459,2,FALSE)))","v":"2020-06-24"},null,null,null,null,0,null,null,""]
[625,null,{"$f":"IF(ISNA(IF(Summary!$B$5=3,IF(VLOOKUP(A33,Calendar!$A$64:$G$459,7,FALSE)=\"S\", \"\", VLOOKUP(A33,Calendar!$A$64:$G$459,7,FALSE)),IF(VLOOKUP(A33,Calendar!$A$64:$G$459,4,FALSE)=\"S\", \"\", VLOOKUP(A33,Calendar!$A$64:$G$459,4,FALSE)))),\"\",IF(Summary!$B$5=3,IF(VLOOKUP(A33,Calendar!$A$64:$G$459,7,FALSE)=\"S\", \"\", VLOOKUP(A33,Calendar!$A$64:$G$459,7,FALSE)),IF(VLOOKUP(A33,Calendar!$A$64:$G$459,4,FALSE)=\"S\", \"\", VLOOKUP(A33,Calendar!$A$64:$G$459,4,FALSE))))","v":"R"},{"$f":"IF(Summary!$B$5=3,IF(C33=\"\",\"\",VLOOKUP(A33,Calendar!$A$64:$G$459,5,FALSE)),IF(C33=\"\",\"\",VLOOKUP(A33,Calendar!$A$64:$G$459,2,FALSE)))","v":"2020-06-25"},null,null,null,null,0,null,null,""]
[626,null,{"$f":"IF(ISNA(IF(Summary!$B$5=3,IF(VLOOKUP(A34,Calendar!$A$64:$G$459,7,FALSE)=\"S\", \"\", VLOOKUP(A34,Calendar!$A$64:$G$459,7,FALSE)),IF(VLOOKUP(A34,Calendar!$A$64:$G$459,4,FALSE)=\"S\", \"\", VLOOKUP(A34,Calendar!$A$64:$G$459,4,FALSE)))),\"\",IF(Summary!$B$5=3,IF(VLOOKUP(A34,Calendar!$A$64:$G$459,7,FALSE)=\"S\", \"\", VLOOKUP(A34,Calendar!$A$64:$G$459,7,FALSE)),IF(VLOOKUP(A34,Calendar!$A$64:$G$459,4,FALSE)=\"S\", \"\", VLOOKUP(A34,Calendar!$A$64:$G$459,4,FALSE))))","v":"F"},{"$f":"IF(Summary!$B$5=3,IF(C34=\"\",\"\",VLOOKUP(A34,Calendar!$A$64:$G$459,5,FALSE)),IF(C34=\"\",\"\",VLOOKUP(A34,Calendar!$A$64:$G$459,2,FALSE)))","v":"2020-06-26"},null,null,null,null,0,null,null,""]
[627,null,{"$f":"IF(ISNA(IF(Summary!$B$5=3,IF(VLOOKUP(A35,Calendar!$A$64:$G$459,7,FALSE)=\"S\", \"\", VLOOKUP(A35,Calendar!$A$64:$G$459,7,FALSE)),IF(VLOOKUP(A35,Calendar!$A$64:$G$459,4,FALSE)=\"S\", \"\", VLOOKUP(A35,Calendar!$A$64:$G$459,4,FALSE)))),\"\",IF(Summary!$B$5=3,IF(VLOOKUP(A35,Calendar!$A$64:$G$459,7,FALSE)=\"S\", \"\", VLOOKUP(A35,Calendar!$A$64:$G$459,7,FALSE)),IF(VLOOKUP(A35,Calendar!$A$64:$G$459,4,FALSE)=\"S\", \"\", VLOOKUP(A35,Calendar!$A$64:$G$459,4,FALSE))))","v":""},{"$f":"IF(Summary!$B$5=3,IF(C35=\"\",\"\",VLOOKUP(A35,Calendar!$A$64:$G$459,5,FALSE)),IF(C35=\"\",\"\",VLOOKUP(A35,Calendar!$A$64:$G$459,2,FALSE)))","v":""},null,null,null,null,0,null,null,""]
[628,null,{"$f":"IF(ISNA(IF(Summary!$B$5=3,IF(VLOOKUP(A36,Calendar!$A$64:$G$459,7,FALSE)=\"S\", \"\", VLOOKUP(A36,Calendar!$A$64:$G$459,7,FALSE)),IF(VLOOKUP(A36,Calendar!$A$64:$G$459,4,FALSE)=\"S\", \"\", VLOOKUP(A36,Calendar!$A$64:$G$459,4,FALSE)))),\"\",IF(Summary!$B$5=3,IF(VLOOKUP(A36,Calendar!$A$64:$G$459,7,FALSE)=\"S\", \"\", VLOOKUP(A36,Calendar!$A$64:$G$459,7,FALSE)),IF(VLOOKUP(A36,Calendar!$A$64:$G$459,4,FALSE)=\"S\", \"\", VLOOKUP(A36,Calendar!$A$64:$G$459,4,FALSE))))","v":""},{"$f":"IF(Summary!$B$5=3,IF(C36=\"\",\"\",VLOOKUP(A36,Calendar!$A$64:$G$459,5,FALSE)),IF(C36=\"\",\"\",VLOOKUP(A36,Calendar!$A$64:$G$459,2,FALSE)))","v":""},null,null,null,null,0,null,null,""]
[629,null,{"$f":"IF(ISNA(IF(Summary!$B$5=3,IF(VLOOKUP(A37,Calendar!$A$64:$G$459,7,FALSE)=\"S\", \"\", VLOOKUP(A37,Calendar!$A$64:$G$459,7,FALSE)),IF(VLOOKUP(A37,Calendar!$A$64:$G$459,4,FALSE)=\"S\", \"\", VLOOKUP(A37,Calendar!$A$64:$G$459,4,FALSE)))),\"\",IF(Summary!$B$5=3,IF(VLOOKUP(A37,Calendar!$A$64:$G$459,7,FALSE)=\"S\", \"\", VLOOKUP(A37,Calendar!$A$64:$G$459,7,FALSE)),IF(VLOOKUP(A37,Calendar!$A$64:$G$459,4,FALSE)=\"S\", \"\", VLOOKUP(A37,Calendar!$A$64:$G$459,4,FALSE))))","v":"M"},{"$f":"IF(Summary!$B$5=3,IF(C37=\"\",\"\",VLOOKUP(A37,Calendar!$A$64:$G$459,5,FALSE)),IF(C37=\"\",\"\",VLOOKUP(A37,Calendar!$A$64:$G$459,2,FALSE)))","v":"2020-06-29"},null,null,null,null,0,null,null,""]
[630,null,{"$f":"IF(ISNA(IF(Summary!$B$5=3,IF(VLOOKUP(A38,Calendar!$A$64:$G$459,7,FALSE)=\"S\", \"\", VLOOKUP(A38,Calendar!$A$64:$G$459,7,FALSE)),IF(VLOOKUP(A38,Calendar!$A$64:$G$459,4,FALSE)=\"S\", \"\", VLOOKUP(A38,Calendar!$A$64:$G$459,4,FALSE)))),\"\",IF(Summary!$B$5=3,IF(VLOOKUP(A38,Calendar!$A$64:$G$459,7,FALSE)=\"S\", \"\", VLOOKUP(A38,Calendar!$A$64:$G$459,7,FALSE)),IF(VLOOKUP(A38,Calendar!$A$64:$G$459,4,FALSE)=\"S\", \"\", VLOOKUP(A38,Calendar!$A$64:$G$459,4,FALSE))))","v":"T"},{"$f":"IF(Summary!$B$5=3,IF(C38=\"\",\"\",VLOOKUP(A38,Calendar!$A$64:$G$459,5,FALSE)),IF(C38=\"\",\"\",VLOOKUP(A38,Calendar!$A$64:$G$459,2,FALSE)))","v":"2020-06-30"},null,null,null,null,0,null,null,""]
[null,null,{"$f":"IF(ISNA(IF(Summary!$B$5=3,IF(VLOOKUP(A39,Calendar!$A$64:$G$459,7,FALSE)=\"S\", \"\", VLOOKUP(A39,Calendar!$A$64:$G$459,7,FALSE)),IF(VLOOKUP(A39,Calendar!$A$64:$G$459,4,FALSE)=\"S\", \"\", VLOOKUP(A39,Calendar!$A$64:$G$459,4,FALSE)))),\"\",IF(Summary!$B$5=3,IF(VLOOKUP(A39,Calendar!$A$64:$G$459,7,FALSE)=\"S\", \"\", VLOOKUP(A39,Calendar!$A$64:$G$459,7,FALSE)),IF(VLOOKUP(A39,Calendar!$A$64:$G$459,4,FALSE)=\"S\", \"\", VLOOKUP(A39,Calendar!$A$64:$G$459,4,FALSE))))","v":""},{"$f":"IF(Summary!$B$5=3,IF(C39=\"\",\"\",VLOOKUP(A39,Calendar!$A$64:$G$459,5,FALSE)),IF(C39=\"\",\"\",VLOOKUP(A39,Calendar!$A$64:$G$459,2,FALSE)))","v":""},null,null,null,null,0,null,null,""]
[null,null,null,"Totals",{"$f":"SUM(E9:E39)","v":0},{"$f":"SUM(F9:F39)","v":0},0,0,0,null,null,{"$f":"IF(SUM(E40:H40)>COUNTA(E9:E39)*390,\"The sum total for all cost objectives exceeds the maximum anticipated value based upon the number of days worked. Confirm minutes claimed for each day.\",\"\")","v":""}]
[null,null,null,"Hours",{"$f":"E40/60","v":0},{"$f":"F40/60","v":0},0,0,0]
[]
[]
[null,null,"Notes"]
[]
[]
[]
[]
[]
[]
[]
[]
[]
[]
[null,null,null,null,"Kansas State Department of Education",null,null,null,"Personnel Activity Report"]
[null,null,null,null,"Fiscal Auditing",null,null,null,"Updated 9/20/18"]
[null,null,null,null,"785-296-4976"]
[null,null,null,null,"https://www.ksde.org/Agency/Fiscal-and-Administrative-Services/Fiscal-Auditing"]
[]
[]
[null,null,"The Kansas State Department of Education does not discriminate on the basis of race, color, national origin, sex, disability, or age in its programs and activities and provides equal access to the Boy Scouts and other designated youth groups. The following person has been designated to handle inquiries regarding the nondiscrimination policies: KSDE General Counsel, Office of General Counsel, KSDE, Landon State Office Building, 900 S.W. Jackson, Suite 102, Topeka, KS 66612, (785) 296-3204."]

{"sheet":"Calendar","index":14,"n_rows":461,"n_cols":14,"rows_kept":461,"cut":false,"hidden":true,"merged":[]}
[]
["Seq","Date","Day Number","Day","Date","Day Number","Day","Month"]
[{"$f":"1*(CONCATENATE(TEXT(H3,0),TEXT(I3,\"00\")))","v":501},"2018-05-01",{"$f":"WEEKDAY(B3)","v":3},{"$f":"VLOOKUP(C3,$M$3:$N$9,2,FALSE)","v":"T"},"2019-05-01",{"$f":"WEEKDAY(E3)","v":4},{"$f":"VLOOKUP(F3,$M$3:$N$9,2,FALSE)","v":"W"},{"$f":"MONTH(B3)","v":5},{"$f":"DAY(B3)","v":1},{"$f":"RIGHT(YEAR(B3),1)","v":"8"},{"$f":"RIGHT(YEAR(E3),1)","v":"9"},null,1,"S"]
[{"$f":"1*(CONCATENATE(TEXT(H4,0),TEXT(I4,\"00\")))","v":502},"2018-05-02",4,"W","2019-05-02",5,"R",5,2,{"$f":"RIGHT(YEAR(B4),1)","v":"8"},{"$f":"RIGHT(YEAR(E4),1)","v":"9"},null,2,"M"]
[503,"2018-05-03",5,"R","2019-05-03",6,"F",5,3,"8","9",null,3,"T"]
[504,"2018-05-04",6,"F","2019-05-04",7,"S",5,4,"8","9",null,4,"W"]
[505,"2018-05-05",7,"S","2019-05-05",1,"S",5,5,"8","9",null,5,"R"]
[506,"2018-05-06",1,"S","2019-05-06",2,"M",5,6,"8","9",null,6,"F"]
[507,"2018-05-07",2,"M","2019-05-07",3,"T",5,7,"8","9",null,7,"S"]
[508,"2018-05-08",3,"T","2019-05-08",4,"W",5,8,"8","9"]
[509,"2018-05-09",4,"W","2019-05-09",5,"R",5,9,"8","9",null,1,"Please Select"]
[510,"2018-05-10",5,"R","2019-05-10",6,"F",5,10,"8","9",null,2,"2018-19 School Year"]
[511,"2018-05-11",6,"F","2019-05-11",7,"S",5,11,"8","9",null,3,"2019-20 School Year"]
[512,"2018-05-12",7,"S","2019-05-12",1,"S",5,12,"8","9"]
[513,"2018-05-13",1,"S","2019-05-13",2,"M",5,13,"8","9"]
[514,"2018-05-14",2,"M","2019-05-14",3,"T",5,14,"8","9"]
[515,"2018-05-15",3,"T","2019-05-15",4,"W",5,15,"8","9"]
[516,"2018-05-16",4,"W","2019-05-16",5,"R",5,16,"8","9"]
[517,"2018-05-17",5,"R","2019-05-17",6,"F",5,17,"8","9"]
[518,"2018-05-18",6,"F","2019-05-18",7,"S",5,18,"8","9"]
[519,"2018-05-19",7,"S","2019-05-19",1,"S",5,19,"8","9"]
[520,"2018-05-20",1,"S","2019-05-20",2,"M",5,20,"8","9"]
[521,"2018-05-21",2,"M","2019-05-21",3,"T",5,21,"8","9"]
[522,"2018-05-22",3,"T","2019-05-22",4,"W",5,22,"8","9"]
[523,"2018-05-23",4,"W","2019-05-23",5,"R",5,23,"8","9"]
[524,"2018-05-24",5,"R","2019-05-24",6,"F",5,24,"8","9"]
[525,"2018-05-25",6,"F","2019-05-25",7,"S",5,25,"8","9"]
[526,"2018-05-26",7,"S","2019-05-26",1,"S",5,26,"8","9"]
[527,"2018-05-27",1,"S","2019-05-27",2,"M",5,27,"8","9"]
[528,"2018-05-28",2,"M","2019-05-28",3,"T",5,28,"8","9"]
[529,"2018-05-29",3,"T","2019-05-29",4,"W",5,29,"8","9"]
[530,"2018-05-30",4,"W","2019-05-30",5,"R",5,30,"8","9"]
[531,"2018-05-31",5,"R","2019-05-31",6,"F",5,31,"8","9"]
[601,"2018-06-01",6,"F","2019-06-01",7,"S",6,1,"8","9"]
[602,"2018-06-02",7,"S","2019-06-02",1,"S",6,2,"8","9"]
[603,"2018-06-03",1,"S","2019-06-03",2,"M",6,3,"8","9"]
[604,"2018-06-04",2,"M","2019-06-04",3,"T",6,4,"8","9"]
[605,"2018-06-05",3,"T","2019-06-05",4,"W",6,5,"8","9"]
[606,"2018-06-06",4,"W","2019-06-06",5,"R",6,6,"8","9"]
[607,"2018-06-07",5,"R","2019-06-07",6,"F",6,7,"8","9"]
[608,"2018-06-08",6,"F","2019-06-08",7,"S",6,8,"8","9"]
[609,"2018-06-09",7,"S","2019-06-09",1,"S",6,9,"8","9"]
[610,"2018-06-10",1,"S","2019-06-10",2,"M",6,10,"8","9"]
[611,"2018-06-11",2,"M","2019-06-11",3,"T",6,11,"8","9"]
[612,"2018-06-12",3,"T","2019-06-12",4,"W",6,12,"8","9"]
[613,"2018-06-13",4,"W","2019-06-13",5,"R",6,13,"8","9"]
[614,"2018-06-14",5,"R","2019-06-14",6,"F",6,14,"8","9"]
[615,"2018-06-15",6,"F","2019-06-15",7,"S",6,15,"8","9"]
[616,"2018-06-16",7,"S","2019-06-16",1,"S",6,16,"8","9"]
[617,"2018-06-17",1,"S","2019-06-17",2,"M",6,17,"8","9"]
[618,"2018-06-18",2,"M","2019-06-18",3,"T",6,18,"8","9"]
[619,"2018-06-19",3,"T","2019-06-19",4,"W",6,19,"8","9"]
[620,"2018-06-20",4,"W","2019-06-20",5,"R",6,20,"8","9"]
[621,"2018-06-21",5,"R","2019-06-21",6,"F",6,21,"8","9"]
[622,"2018-06-22",6,"F","2019-06-22",7,"S",6,22,"8","9"]
[623,"2018-06-23",7,"S","2019-06-23",1,"S",6,23,"8","9"]
[624,"2018-06-24",1,"S","2019-06-24",2,"M",6,24,"8","9"]
[625,"2018-06-25",2,"M","2019-06-25",3,"T",6,25,"8","9"]
[626,"2018-06-26",3,"T","2019-06-26",4,"W",6,26,"8","9"]
[627,"2018-06-27",4,"W","2019-06-27",5,"R",6,27,"8","9"]
[628,"2018-06-28",5,"R","2019-06-28",6,"F",6,28,"8","9"]
[629,"2018-06-29",6,"F","2019-06-29",7,"S",6,29,"8","9"]
[630,"2018-06-30",7,"S","2019-06-30",1,"S",6,30,"8","9"]
[701,"2018-07-01",1,"S","2019-07-01",2,"M",7,1,"8","9"]
[702,"2018-07-02",2,"M","2019-07-02",3,"T",7,2,"8","9"]
[703,"2018-07-03",3,"T","2019-07-03",4,"W",7,3,"8","9"]
[704,"2018-07-04",{"$f":"WEEKDAY(B67)","v":4},{"$f":"VLOOKUP(C67,$M$3:$N$9,2,FALSE)","v":"W"},"2019-07-04",{"$f":"WEEKDAY(E67)","v":5},{"$f":"VLOOKUP(F67,$M$3:$N$9,2,FALSE)","v":"R"},{"$f":"MONTH(B67)","v":7},{"$f":"DAY(B67)","v":4},"8","9"]
[{"$f":"1*(CONCATENATE(TEXT(H68,0),TEXT(I68,\"00\")))","v":705},"2018-07-05",5,"R","2019-07-05",6,"F",7,5,{"$f":"RIGHT(YEAR(B68),1)","v":"8"},{"$f":"RIGHT(YEAR(E68),1)","v":"9"}]
[706,"2018-07-06",6,"F","2019-07-06",7,"S",7,6,"8","9"]
[707,"2018-07-07",7,"S","2019-07-07",1,"S",7,7,"8","9"]
[708,"2018-07-08",1,"S","2019-07-08",2,"M",7,8,"8","9"]
[709,"2018-07-09",2,"M","2019-07-09",3,"T",7,9,"8","9"]
[710,"2018-07-10",3,"T","2019-07-10",4,"W",7,10,"8","9"]
[711,"2018-07-11",4,"W","2019-07-11",5,"R",7,11,"8","9"]
[712,"2018-07-12",5,"R","2019-07-12",6,"F",7,12,"8","9"]
[713,"2018-07-13",6,"F","2019-07-13",7,"S",7,13,"8","9"]
[714,"2018-07-14",7,"S","2019-07-14",1,"S",7,14,"8","9"]
[715,"2018-07-15",1,"S","2019-07-15",2,"M",7,15,"8","9"]
[716,"2018-07-16",2,"M","2019-07-16",3,"T",7,16,"8","9"]
[717,"2018-07-17",3,"T","2019-07-17",4,"W",7,17,"8","9"]
[718,"2018-07-18",4,"W","2019-07-18",5,"R",7,18,"8","9"]
[719,"2018-07-19",5,"R","2019-07-19",6,"F",7,19,"8","9"]
[720,"2018-07-20",6,"F","2019-07-20",7,"S",7,20,"8","9"]
[721,"2018-07-21",7,"S","2019-07-21",1,"S",7,21,"8","9"]
[722,"2018-07-22",1,"S","2019-07-22",2,"M",7,22,"8","9"]
[723,"2018-07-23",2,"M","2019-07-23",3,"T",7,23,"8","9"]
[724,"2018-07-24",3,"T","2019-07-24",4,"W",7,24,"8","9"]
[725,"2018-07-25",4,"W","2019-07-25",5,"R",7,25,"8","9"]
[726,"2018-07-26",5,"R","2019-07-26",6,"F",7,26,"8","9"]
[727,"2018-07-27",6,"F","2019-07-27",7,"S",7,27,"8","9"]
[728,"2018-07-28",7,"S","2019-07-28",1,"S",7,28,"8","9"]
[729,"2018-07-29",1,"S","2019-07-29",2,"M",7,29,"8","9"]
[730,"2018-07-30",2,"M","2019-07-30",3,"T",7,30,"8","9"]
[731,"2018-07-31",3,"T","2019-07-31",4,"W",7,31,"8","9"]
[801,"2018-08-01",{"$f":"WEEKDAY(B95)","v":4},{"$f":"VLOOKUP(C95,$M$3:$N$9,2,FALSE)","v":"W"},"2019-08-01",{"$f":"WEEKDAY(E95)","v":5},{"$f":"VLOOKUP(F95,$M$3:$N$9,2,FALSE)","v":"R"},{"$f":"MONTH(B95)","v":8},{"$f":"DAY(B95)","v":1},"8","9"]
[802,"2018-08-02",{"$f":"WEEKDAY(B96)","v":5},{"$f":"VLOOKUP(C96,$M$3:$N$9,2,FALSE)","v":"R"},"2019-08-02",{"$f":"WEEKDAY(E96)","v":6},{"$f":"VLOOKUP(F96,$M$3:$N$9,2,FALSE)","v":"F"},8,{"$f":"DAY(B96)","v":2},"8","9"]
[803,"2018-08-03",6,"F","2019-08-03",7,"S",8,3,"8","9"]
[804,"2018-08-04",7,"S","2019-08-04",1,"S",8,4,"8","9"]
[805,"2018-08-05",1,"S","2019-08-05",2,"M",8,5,"8","9"]
[806,"2018-08-06",2,"M","2019-08-06",3,"T",8,6,"8","9"]
[807,"2018-08-07",3,"T","2019-08-07",4,"W",8,7,"8","9"]
[808,"2018-08-08",4,"W","2019-08-08",5,"R",8,8,"8","9"]
[809,"2018-08-09",5,"R","2019-08-09",6,"F",8,9,"8","9"]
[810,"2018-08-10",6,"F","2019-08-10",7,"S",8,10,"8","9"]
[811,"2018-08-11",7,"S","2019-08-11",1,"S",8,11,"8","9"]
[812,"2018-08-12",1,"S","2019-08-12",2,"M",8,12,"8","9"]
[813,"2018-08-13",2,"M","2019-08-13",3,"T",8,13,"8","9"]
[814,"2018-08-14",3,"T","2019-08-14",4,"W",8,14,"8","9"]
[815,"2018-08-15",4,"W","2019-08-15",5,"R",8,15,"8","9"]
[816,"2018-08-16",5,"R","2019-08-16",6,"F",8,16,"8","9"]
[817,"2018-08-17",6,"F","2019-08-17",7,"S",8,17,"8","9"]
[818,"2018-08-18",7,"S","2019-08-18",1,"S",8,18,"8","9"]
[819,"2018-08-19",1,"S","2019-08-19",2,"M",8,19,"8","9"]
[820,"2018-08-20",2,"M","2019-08-20",3,"T",8,20,"8","9"]
[821,"2018-08-21",3,"T","2019-08-21",4,"W",8,21,"8","9"]
[822,"2018-08-22",4,"W","2019-08-22",5,"R",8,22,"8","9"]
[823,"2018-08-23",5,"R","2019-08-23",6,"F",8,23,"8","9"]
[824,"2018-08-24",6,"F","2019-08-24",7,"S",8,24,"8","9"]
[825,"2018-08-25",7,"S","2019-08-25",1,"S",8,25,"8","9"]
[826,"2018-08-26",1,"S","2019-08-26",2,"M",8,26,"8","9"]
[827,"2018-08-27",2,"M","2019-08-27",3,"T",8,27,"8","9"]
[828,"2018-08-28",3,"T","2019-08-28",4,"W",8,28,"8","9"]
[829,"2018-08-29",4,"W","2019-08-29",5,"R",8,29,"8","9"]
[830,"2018-08-30",5,"R","2019-08-30",6,"F",8,30,"8","9"]
[831,"2018-08-31",6,"F","2019-08-31",7,"S",8,31,"8","9"]
[901,"2018-09-01",7,"S","2019-09-01",1,"S",9,1,"8","9"]
[902,"2018-09-02",1,"S","2019-09-02",2,"M",9,2,"8","9"]
[903,"2018-09-03",2,"M","2019-09-03",3,"T",9,3,"8","9"]
[904,"2018-09-04",3,"T","2019-09-04",4,"W",9,4,"8","9"]
[905,"2018-09-05",4,"W","2019-09-05",5,"R",9,5,"8","9"]
[906,"2018-09-06",5,"R","2019-09-06",6,"F",9,6,"8","9"]
[{"$f":"1*(CONCATENATE(TEXT(H132,0),TEXT(I132,\"00\")))","v":907},"2018-09-07",6,"F","2019-09-07",7,"S",9,7,{"$f":"RIGHT(YEAR(B132),1)","v":"8"},{"$f":"RIGHT(YEAR(E132),1)","v":"9"}]
[908,"2018-09-08",7,"S","2019-09-08",1,"S",9,8,"8","9"]
[909,"2018-09-09",1,"S","2019-09-09",2,"M",9,9,"8","9"]
[910,"2018-09-10",2,"M","2019-09-10",3,"T",9,10,"8","9"]
[911,"2018-09-11",3,"T","2019-09-11",4,"W",9,11,"8","9"]
[912,"2018-09-12",4,"W","2019-09-12",5,"R",9,12,"8","9"]
[913,"2018-09-13",5,"R","2019-09-13",6,"F",9,13,"8","9"]
[914,"2018-09-14",6,"F","2019-09-14",7,"S",9,14,"8","9"]
[915,"2018-09-15",7,"S","2019-09-15",1,"S",9,15,"8","9"]
[916,"2018-09-16",1,"S","2019-09-16",2,"M",9,16,"8","9"]
[917,"2018-09-17",2,"M","2019-09-17",3,"T",9,17,"8","9"]
[918,"2018-09-18",3,"T","2019-09-18",4,"W",9,18,"8","9"]
[919,"2018-09-19",4,"W","2019-09-19",5,"R",9,19,"8","9"]
[920,"2018-09-20",5,"R","2019-09-20",6,"F",9,20,"8","9"]
[921,"2018-09-21",6,"F","2019-09-21",7,"S",9,21,"8","9"]
[922,"2018-09-22",7,"S","2019-09-22",1,"S",9,22,"8","9"]
[923,"2018-09-23",1,"S","2019-09-23",2,"M",9,23,"8","9"]
[924,"2018-09-24",2,"M","2019-09-24",3,"T",9,24,"8","9"]
[925,"2018-09-25",3,"T","2019-09-25",4,"W",9,25,"8","9"]
[926,"2018-09-26",4,"W","2019-09-26",5,"R",9,26,"8","9"]
[927,"2018-09-27",5,"R","2019-09-27",6,"F",9,27,"8","9"]
[928,"2018-09-28",6,"F","2019-09-28",7,"S",9,28,"8","9"]
[929,"2018-09-29",7,"S","2019-09-29",1,"S",9,29,"8","9"]
[930,"2018-09-30",1,"S","2019-09-30",2,"M",9,30,"8","9"]
[1001,"2018-10-01",2,"M","2019-10-01",3,"T",10,1,"8","9"]
[1002,"2018-10-02",3,"T","2019-10-02",4,"W",10,2,"8","9"]
[1003,"2018-10-03",4,"W","2019-10-03",5,"R",10,3,"8","9"]
[1004,"2018-10-04",5,"R","2019-10-04",6,"F",{"$f":"MONTH(B159)","v":10},4,"8","9"]
[1005,"2018-10-05",{"$f":"WEEKDAY(B160)","v":6},{"$f":"VLOOKUP(C160,$M$3:$N$9,2,FALSE)","v":"F"},"2019-10-05",{"$f":"WEEKDAY(E160)","v":7},{"$f":"VLOOKUP(F160,$M$3:$N$9,2,FALSE)","v":"S"},10,{"$f":"DAY(B160)","v":5},"8","9"]
[1006,"2018-10-06",7,"S","2019-10-06",1,"S",10,6,"8","9"]
[1007,"2018-10-07",1,"S","2019-10-07",2,"M",10,7,"8","9"]
[1008,"2018-10-08",2,"M","2019-10-08",3,"T",10,8,"8","9"]
[1009,"2018-10-09",3,"T","2019-10-09",4,"W",10,9,"8","9"]
[1010,"2018-10-10",4,"W","2019-10-10",5,"R",10,10,"8","9"]
[1011,"2018-10-11",5,"R","2019-10-11",6,"F",10,11,"8","9"]
[1012,"2018-10-12",6,"F","2019-10-12",7,"S",10,12,"8","9"]
[1013,"2018-10-13",7,"S","2019-10-13",1,"S",10,13,"8","9"]
[1014,"2018-10-14",1,"S","2019-10-14",2,"M",10,14,"8","9"]
[1015,"2018-10-15",2,"M","2019-10-15",3,"T",10,15,"8","9"]
[1016,"2018-10-16",3,"T","2019-10-16",4,"W",10,16,"8","9"]
[1017,"2018-10-17",4,"W","2019-10-17",5,"R",10,17,"8","9"]
[1018,"2018-10-18",5,"R","2019-10-18",6,"F",10,18,"8","9"]
[1019,"2018-10-19",6,"F","2019-10-19",7,"S",10,19,"8","9"]
[1020,"2018-10-20",7,"S","2019-10-20",1,"S",10,20,"8","9"]
[1021,"2018-10-21",1,"S","2019-10-21",2,"M",10,21,"8","9"]
[1022,"2018-10-22",2,"M","2019-10-22",3,"T",10,22,"8","9"]
[1023,"2018-10-23",3,"T","2019-10-23",4,"W",10,23,"8","9"]
[1024,"2018-10-24",4,"W","2019-10-24",5,"R",10,24,"8","9"]
[1025,"2018-10-25",5,"R","2019-10-25",6,"F",10,25,"8","9"]
[1026,"2018-10-26",6,"F","2019-10-26",7,"S",10,26,"8","9"]
[1027,"2018-10-27",7,"S","2019-10-27",1,"S",10,27,"8","9"]
[1028,"2018-10-28",1,"S","2019-10-28",2,"M",10,28,"8","9"]
[1029,"2018-10-29",2,"M","2019-10-29",3,"T",10,29,"8","9"]
[1030,"2018-10-30",3,"T","2019-10-30",4,"W",10,30,"8","9"]
[1031,"2018-10-31",4,"W","2019-10-31",5,"R",10,31,"8","9"]
[1101,"2018-11-01",5,"R","2019-11-01",6,"F",11,1,"8","9"]
[1102,"2018-11-02",6,"F","2019-11-02",7,"S",11,2,"8","9"]
[1103,"2018-11-03",7,"S","2019-11-03",1,"S",11,3,"8","9"]
[1104,"2018-11-04",1,"S","2019-11-04",2,"M",11,4,"8","9"]
[1105,"2018-11-05",2,"M","2019-11-05",3,"T",11,5,"8","9"]
[1106,"2018-11-06",3,"T","2019-11-06",4,"W",11,6,"8","9"]
[1107,"2018-11-07",4,"W","2019-11-07",5,"R",11,7,"8","9"]
[1108,"2018-11-08",5,"R","2019-11-08",6,"F",11,8,"8","9"]
[1109,"2018-11-09",6,"F","2019-11-09",7,"S",11,9,"8","9"]
[{"$f":"1*(CONCATENATE(TEXT(H196,0),TEXT(I196,\"00\")))","v":1110},"2018-11-10",7,"S","2019-11-10",1,"S",11,10,{"$f":"RIGHT(YEAR(B196),1)","v":"8"},{"$f":"RIGHT(YEAR(E196),1)","v":"9"}]
[1111,"2018-11-11",1,"S","2019-11-11",2,"M",11,11,"8","9"]
[1112,"2018-11-12",2,"M","2019-11-12",3,"T",11,12,"8","9"]
[1113,"2018-11-13",3,"T","2019-11-13",4,"W",11,13,"8","9"]
[1114,"2018-11-14",4,"W","2019-11-14",5,"R",11,14,"8","9"]
[1115,"2018-11-15",5,"R","2019-11-15",6,"F",11,15,"8","9"]
[1116,"2018-11-16",6,"F","2019-11-16",7,"S",11,16,"8","9"]
[1117,"2018-11-17",7,"S","2019-11-17",1,"S",11,17,"8","9"]
[1118,"2018-11-18",1,"S","2019-11-18",2,"M",11,18,"8","9"]
[1119,"2018-11-19",2,"M","2019-11-19",3,"T",11,19,"8","9"]
[1120,"2018-11-20",3,"T","2019-11-20",4,"W",11,20,"8","9"]
[1121,"2018-11-21",4,"W","2019-11-21",5,"R",11,21,"8","9"]
[1122,"2018-11-22",5,"R","2019-11-22",6,"F",11,22,"8","9"]
[1123,"2018-11-23",6,"F","2019-11-23",7,"S",11,23,"8","9"]
[1124,"2018-11-24",7,"S","2019-11-24",1,"S",11,24,"8","9"]
[1125,"2018-11-25",1,"S","2019-11-25",2,"M",11,25,"8","9"]
[1126,"2018-11-26",2,"M","2019-11-26",3,"T",11,26,"8","9"]
[1127,"2018-11-27",3,"T","2019-11-27",4,"W",11,27,"8","9"]
[1128,"2018-11-28",4,"W","2019-11-28",5,"R",11,28,"8","9"]
[1129,"2018-11-29",5,"R","2019-11-29",6,"F",11,29,"8","9"]
[1130,"2018-11-30",6,"F","2019-11-30",7,"S",11,30,"8","9"]
[1201,"2018-12-01",7,"S","2019-12-01",1,"S",12,1,"8","9"]
[1202,"2018-12-02",1,"S","2019-12-02",2,"M",12,2,"8","9"]
[1203,"2018-12-03",2,"M","2019-12-03",3,"T",12,3,"8","9"]
[1204,"2018-12-04",3,"T","2019-12-04",4,"W",12,4,"8","9"]
[1205,"2018-12-05",4,"W","2019-12-05",5,"R",12,5,"8","9"]
[1206,"2018-12-06",5,"R","2019-12-06",6,"F",12,6,"8","9"]
[1207,"2018-12-07",6,"F","2019-12-07",7,"S",{"$f":"MONTH(B223)","v":12},7,"8","9"]
[1208,"2018-12-08",{"$f":"WEEKDAY(B224)","v":7},{"$f":"VLOOKUP(C224,$M$3:$N$9,2,FALSE)","v":"S"},"2019-12-08",{"$f":"WEEKDAY(E224)","v":1},{"$f":"VLOOKUP(F224,$M$3:$N$9,2,FALSE)","v":"S"},12,{"$f":"DAY(B224)","v":8},"8","9"]
[1209,"2018-12-09",1,"S","2019-12-09",2,"M",12,9,"8","9"]
[1210,"2018-12-10",2,"M","2019-12-10",3,"T",12,10,"8","9"]
[1211,"2018-12-11",3,"T","2019-12-11",4,"W",12,11,"8","9"]
[1212,"2018-12-12",4,"W","2019-12-12",5,"R",12,12,"8","9"]
[1213,"2018-12-13",5,"R","2019-12-13",6,"F",12,13,"8","9"]
[1214,"2018-12-14",6,"F","2019-12-14",7,"S",12,14,"8","9"]
[1215,"2018-12-15",7,"S","2019-12-15",1,"S",12,15,"8","9"]
[1216,"2018-12-16",1,"S","2019-12-16",2,"M",12,16,"8","9"]
[1217,"2018-12-17",2,"M","2019-12-17",3,"T",12,17,"8","9"]
[1218,"2018-12-18",3,"T","2019-12-18",4,"W",12,18,"8","9"]
[1219,"2018-12-19",4,"W","2019-12-19",5,"R",12,19,"8","9"]
[1220,"2018-12-20",5,"R","2019-12-20",6,"F",12,20,"8","9"]
[1221,"2018-12-21",6,"F","2019-12-21",7,"S",12,21,"8","9"]
[1222,"2018-12-22",7,"S","2019-12-22",1,"S",12,22,"8","9"]
[1223,"2018-12-23",1,"S","2019-12-23",2,"M",12,23,"8","9"]
[1224,"2018-12-24",2,"M","2019-12-24",3,"T",12,24,"8","9"]
[1225,"2018-12-25",3,"T","2019-12-25",4,"W",12,25,"8","9"]
[1226,"2018-12-26",4,"W","2019-12-26",5,"R",12,26,"8","9"]
[1227,"2018-12-27",5,"R","2019-12-27",6,"F",12,27,"8","9"]
[1228,"2018-12-28",6,"F","2019-12-28",7,"S",12,28,"8","9"]
[1229,"2018-12-29",7,"S","2019-12-29",1,"S",12,29,"8","9"]
[1230,"2018-12-30",1,"S","2019-12-30",2,"M",12,30,"8","9"]
[1231,"2018-12-31",2,"M","2019-12-31",3,"T",12,31,"8","9"]
[101,"2019-01-01",3,"T","2020-01-01",4,"W",1,1,"9","0"]
[102,"2019-01-02",4,"W","2020-01-02",5,"R",1,2,"9","0"]
[103,"2019-01-03",5,"R","2020-01-03",6,"F",1,3,"9","0"]
[104,"2019-01-04",6,"F","2020-01-04",7,"S",1,4,"9","0"]
[105,"2019-01-05",7,"S","2020-01-05",1,"S",1,5,"9","0"]
[106,"2019-01-06",1,"S","2020-01-06",2,"M",1,6,"9","0"]
[107,"2019-01-07",2,"M","2020-01-07",3,"T",1,7,"9","0"]
[108,"2019-01-08",3,"T","2020-01-08",4,"W",1,8,"9","0"]
[109,"2019-01-09",4,"W","2020-01-09",5,"R",1,9,"9","0"]
[110,"2019-01-10",5,"R","2020-01-10",6,"F",1,10,"9","0"]
[111,"2019-01-11",6,"F","2020-01-11",7,"S",1,11,"9","0"]
[112,"2019-01-12",7,"S","2020-01-12",1,"S",1,12,"9","0"]
[{"$f":"1*(CONCATENATE(TEXT(H260,0),TEXT(I260,\"00\")))","v":113},"2019-01-13",1,"S","2020-01-13",2,"M",1,13,{"$f":"RIGHT(YEAR(B260),1)","v":"9"},{"$f":"RIGHT(YEAR(E260),1)","v":"0"}]
[114,"2019-01-14",2,"M","2020-01-14",3,"T",1,14,"9","0"]
[115,"2019-01-15",3,"T","2020-01-15",4,"W",1,15,"9","0"]
[116,"2019-01-16",4,"W","2020-01-16",5,"R",1,16,"9","0"]
[117,"2019-01-17",5,"R","2020-01-17",6,"F",1,17,"9","0"]
[118,"2019-01-18",6,"F","2020-01-18",7,"S",1,18,"9","0"]
[119,"2019-01-19",7,"S","2020-01-19",1,"S",1,19,"9","0"]
[120,"2019-01-20",1,"S","2020-01-20",2,"M",1,20,"9","0"]
[121,"2019-01-21",2,"M","2020-01-21",3,"T",1,21,"9","0"]
[122,"2019-01-22",3,"T","2020-01-22",4,"W",1,22,"9","0"]
[123,"2019-01-23",4,"W","2020-01-23",5,"R",1,23,"9","0"]
[124,"2019-01-24",5,"R","2020-01-24",6,"F",1,24,"9","0"]
[125,"2019-01-25",6,"F","2020-01-25",7,"S",1,25,"9","0"]
[126,"2019-01-26",7,"S","2020-01-26",1,"S",1,26,"9","0"]
[127,"2019-01-27",1,"S","2020-01-27",2,"M",1,27,"9","0"]
[128,"2019-01-28",2,"M","2020-01-28",3,"T",1,28,"9","0"]
[129,"2019-01-29",3,"T","2020-01-29",4,"W",1,29,"9","0"]
[130,"2019-01-30",4,"W","2020-01-30",5,"R",1,30,"9","0"]
[131,"2019-01-31",5,"R","2020-01-31",6,"F",1,31,"9","0"]
[201,"2019-02-01",6,"F","2020-02-01",7,"S",2,1,"9","0"]
[202,"2019-02-02",7,"S","2020-02-02",1,"S",2,2,"9","0"]
[203,"2019-02-03",1,"S","2020-02-03",2,"M",2,3,"9","0"]
[204,"2019-02-04",2,"M","2020-02-04",3,"T",2,4,"9","0"]
[205,"2019-02-05",3,"T","2020-02-05",4,"W",2,5,"9","0"]
[206,"2019-02-06",4,"W","2020-02-06",5,"R",2,6,"9","0"]
[207,"2019-02-07",5,"R","2020-02-07",6,"F",2,7,"9","0"]
[208,"2019-02-08",6,"F","2020-02-08",7,"S",2,8,"9","0"]
[209,"2019-02-09",7,"S","2020-02-09",1,"S",{"$f":"MONTH(B287)","v":2},9,"9","0"]
[210,"2019-02-10",{"$f":"WEEKDAY(B288)","v":1},{"$f":"VLOOKUP(C288,$M$3:$N$9,2,FALSE)","v":"S"},"2020-02-10",{"$f":"WEEKDAY(E288)","v":2},{"$f":"VLOOKUP(F288,$M$3:$N$9,2,FALSE)","v":"M"},2,{"$f":"DAY(B288)","v":10},"9","0"]
[211,"2019-02-11",2,"M","2020-02-11",3,"T",2,11,"9","0"]
[212,"2019-02-12",3,"T","2020-02-12",4,"W",2,12,"9","0"]
[213,"2019-02-13",4,"W","2020-02-13",5,"R",2,13,"9","0"]
[214,"2019-02-14",5,"R","2020-02-14",6,"F",2,14,"9","0"]
[215,"2019-02-15",6,"F","2020-02-15",7,"S",2,15,"9","0"]
[216,"2019-02-16",7,"S","2020-02-16",1,"S",2,16,"9","0"]
[217,"2019-02-17",1,"S","2020-02-17",2,"M",2,17,"9","0"]
[218,"2019-02-18",2,"M","2020-02-18",3,"T",2,18,"9","0"]
[219,"2019-02-19",3,"T","2020-02-19",4,"W",2,19,"9","0"]
[220,"2019-02-20",4,"W","2020-02-20",5,"R",2,20,"9","0"]
[221,"2019-02-21",5,"R","2020-02-21",6,"F",2,21,"9","0"]
[222,"2019-02-22",6,"F","2020-02-22",7,"S",2,22,"9","0"]
[223,"2019-02-23",7,"S","2020-02-23",1,"S",2,23,"9","0"]
[224,"2019-02-24",1,"S","2020-02-24",2,"M",2,24,"9","0"]
[225,"2019-02-25",2,"M","2020-02-25",3,"T",2,25,"9","0"]
[226,"2019-02-26",3,"T","2020-02-26",4,"W",2,26,"9","0"]
[227,"2019-02-27",4,"W","2020-02-27",5,"R",2,27,"9","0"]
[228,"2019-02-28",5,"R","2020-02-28",6,"F",2,28,"9","0"]
[229,null,null," ","2020-02-29",7,"S",1,0,0,0,null,"This row adjusted for leap year in 2020"]
[{"$f":"1*(CONCATENATE(TEXT(H308,0),TEXT(I308,\"00\")))","v":301},"2019-03-01",{"$f":"WEEKDAY(B308)","v":6},{"$f":"VLOOKUP(C308,$M$3:$N$9,2,FALSE)","v":"F"},"2020-03-01",1,"S",3,1,"9","0"]
[{"$f":"1*(CONCATENATE(TEXT(H309,0),TEXT(I309,\"00\")))","v":302},"2019-03-02",{"$f":"WEEKDAY(B309)","v":7},{"$f":"VLOOKUP(C309,$M$3:$N$9,2,FALSE)","v":"S"},"2020-03-02",2,"M",3,2,"9","0"]
[{"$f":"1*(CONCATENATE(TEXT(H310,0),TEXT(I310,\"00\")))","v":303},"2019-03-03",{"$f":"WEEKDAY(B310)","v":1},{"$f":"VLOOKUP(C310,$M$3:$N$9,2,FALSE)","v":"S"},"2020-03-03",3,"T",3,3,"9","0"]
[{"$f":"1*(CONCATENATE(TEXT(H311,0),TEXT(I311,\"00\")))","v":304},"2019-03-04",{"$f":"WEEKDAY(B311)","v":2},{"$f":"VLOOKUP(C311,$M$3:$N$9,2,FALSE)","v":"M"},"2020-03-04",4,"W",3,4,"9","0"]
[{"$f":"1*(CONCATENATE(TEXT(H312,0),TEXT(I312,\"00\")))","v":305},"2019-03-05",{"$f":"WEEKDAY(B312)","v":3},{"$f":"VLOOKUP(C312,$M$3:$N$9,2,FALSE)","v":"T"},"2020-03-05",5,"R",3,5,"9","0"]
[{"$f":"1*(CONCATENATE(TEXT(H313,0),TEXT(I313,\"00\")))","v":306},"2019-03-06",{"$f":"WEEKDAY(B313)","v":4},{"$f":"VLOOKUP(C313,$M$3:$N$9,2,FALSE)","v":"W"},"2020-03-06",6,"F",3,6,"9","0"]
[{"$f":"1*(CONCATENATE(TEXT(H314,0),TEXT(I314,\"00\")))","v":307},"2019-03-07",{"$f":"WEEKDAY(B314)","v":5},{"$f":"VLOOKUP(C314,$M$3:$N$9,2,FALSE)","v":"R"},"2020-03-07",7,"S",3,7,"9","0"]
[{"$f":"1*(CONCATENATE(TEXT(H315,0),TEXT(I315,\"00\")))","v":308},"2019-03-08",{"$f":"WEEKDAY(B315)","v":6},{"$f":"VLOOKUP(C315,$M$3:$N$9,2,FALSE)","v":"F"},"2020-03-08",1,"S",3,8,"9","0"]
[{"$f":"1*(CONCATENATE(TEXT(H316,0),TEXT(I316,\"00\")))","v":309},"2019-03-09",{"$f":"WEEKDAY(B316)","v":7},{"$f":"VLOOKUP(C316,$M$3:$N$9,2,FALSE)","v":"S"},"2020-03-09",2,"M",3,9,"9","0"]
[{"$f":"1*(CONCATENATE(TEXT(H317,0),TEXT(I317,\"00\")))","v":310},"2019-03-10",{"$f":"WEEKDAY(B317)","v":1},{"$f":"VLOOKUP(C317,$M$3:$N$9,2,FALSE)","v":"S"},"2020-03-10",3,"T",3,10,"9","0"]
[{"$f":"1*(CONCATENATE(TEXT(H318,0),TEXT(I318,\"00\")))","v":311},"2019-03-11",{"$f":"WEEKDAY(B318)","v":2},{"$f":"VLOOKUP(C318,$M$3:$N$9,2,FALSE)","v":"M"},"2020-03-11",4,"W",3,11,"9","0"]
[{"$f":"1*(CONCATENATE(TEXT(H319,0),TEXT(I319,\"00\")))","v":312},"2019-03-12",{"$f":"WEEKDAY(B319)","v":3},{"$f":"VLOOKUP(C319,$M$3:$N$9,2,FALSE)","v":"T"},"2020-03-12",5,"R",3,12,"9","0"]
[{"$f":"1*(CONCATENATE(TEXT(H320,0),TEXT(I320,\"00\")))","v":313},"2019-03-13",{"$f":"WEEKDAY(B320)","v":4},{"$f":"VLOOKUP(C320,$M$3:$N$9,2,FALSE)","v":"W"},"2020-03-13",6,"F",3,13,"9","0"]
[{"$f":"1*(CONCATENATE(TEXT(H321,0),TEXT(I321,\"00\")))","v":314},"2019-03-14",{"$f":"WEEKDAY(B321)","v":5},{"$f":"VLOOKUP(C321,$M$3:$N$9,2,FALSE)","v":"R"},"2020-03-14",7,"S",3,14,"9","0"]
[{"$f":"1*(CONCATENATE(TEXT(H322,0),TEXT(I322,\"00\")))","v":315},"2019-03-15",{"$f":"WEEKDAY(B322)","v":6},{"$f":"VLOOKUP(C322,$M$3:$N$9,2,FALSE)","v":"F"},"2020-03-15",1,"S",3,15,"9","0"]
[{"$f":"1*(CONCATENATE(TEXT(H323,0),TEXT(I323,\"00\")))","v":316},"2019-03-16",{"$f":"WEEKDAY(B323)","v":7},{"$f":"VLOOKUP(C323,$M$3:$N$9,2,FALSE)","v":"S"},"2020-03-16",2,"M",3,16,"9","0"]
[{"$f":"1*(CONCATENATE(TEXT(H324,0),TEXT(I324,\"00\")))","v":317},"2019-03-17",{"$f":"WEEKDAY(B324)","v":1},{"$f":"VLOOKUP(C324,$M$3:$N$9,2,FALSE)","v":"S"},"2020-03-17",3,"T",3,17,{"$f":"RIGHT(YEAR(B324),1)","v":"9"},{"$f":"RIGHT(YEAR(E324),1)","v":"0"}]
[{"$f":"1*(CONCATENATE(TEXT(H325,0),TEXT(I325,\"00\")))","v":318},"2019-03-18",{"$f":"WEEKDAY(B325)","v":2},{"$f":"VLOOKUP(C325,$M$3:$N$9,2,FALSE)","v":"M"},"2020-03-18",4,"W",3,18,"9","0"]
[{"$f":"1*(CONCATENATE(TEXT(H326,0),TEXT(I326,\"00\")))","v":319},"2019-03-19",{"$f":"WEEKDAY(B326)","v":3},{"$f":"VLOOKUP(C326,$M$3:$N$9,2,FALSE)","v":"T"},"2020-03-19",5,"R",3,19,"9","0"]
[{"$f":"1*(CONCATENATE(TEXT(H327,0),TEXT(I327,\"00\")))","v":320},"2019-03-20",{"$f":"WEEKDAY(B327)","v":4},{"$f":"VLOOKUP(C327,$M$3:$N$9,2,FALSE)","v":"W"},"2020-03-20",6,"F",3,20,"9","0"]
[{"$f":"1*(CONCATENATE(TEXT(H328,0),TEXT(I328,\"00\")))","v":321},"2019-03-21",{"$f":"WEEKDAY(B328)","v":5},{"$f":"VLOOKUP(C328,$M$3:$N$9,2,FALSE)","v":"R"},"2020-03-21",7,"S",3,21,"9","0"]
[{"$f":"1*(CONCATENATE(TEXT(H329,0),TEXT(I329,\"00\")))","v":322},"2019-03-22",{"$f":"WEEKDAY(B329)","v":6},{"$f":"VLOOKUP(C329,$M$3:$N$9,2,FALSE)","v":"F"},"2020-03-22",1,"S",3,22,"9","0"]
[{"$f":"1*(CONCATENATE(TEXT(H330,0),TEXT(I330,\"00\")))","v":323},"2019-03-23",{"$f":"WEEKDAY(B330)","v":7},{"$f":"VLOOKUP(C330,$M$3:$N$9,2,FALSE)","v":"S"},"2020-03-23",2,"M",3,23,"9","0"]
[{"$f":"1*(CONCATENATE(TEXT(H331,0),TEXT(I331,\"00\")))","v":324},"2019-03-24",{"$f":"WEEKDAY(B331)","v":1},{"$f":"VLOOKUP(C331,$M$3:$N$9,2,FALSE)","v":"S"},"2020-03-24",3,"T",3,24,"9","0"]
[{"$f":"1*(CONCATENATE(TEXT(H332,0),TEXT(I332,\"00\")))","v":325},"2019-03-25",{"$f":"WEEKDAY(B332)","v":2},{"$f":"VLOOKUP(C332,$M$3:$N$9,2,FALSE)","v":"M"},"2020-03-25",4,"W",3,25,"9","0"]
[{"$f":"1*(CONCATENATE(TEXT(H333,0),TEXT(I333,\"00\")))","v":326},"2019-03-26",{"$f":"WEEKDAY(B333)","v":3},{"$f":"VLOOKUP(C333,$M$3:$N$9,2,FALSE)","v":"T"},"2020-03-26",5,"R",3,26,"9","0"]
[{"$f":"1*(CONCATENATE(TEXT(H334,0),TEXT(I334,\"00\")))","v":327},"2019-03-27",{"$f":"WEEKDAY(B334)","v":4},{"$f":"VLOOKUP(C334,$M$3:$N$9,2,FALSE)","v":"W"},"2020-03-27",6,"F",3,27,"9","0"]
[{"$f":"1*(CONCATENATE(TEXT(H335,0),TEXT(I335,\"00\")))","v":328},"2019-03-28",{"$f":"WEEKDAY(B335)","v":5},{"$f":"VLOOKUP(C335,$M$3:$N$9,2,FALSE)","v":"R"},"2020-03-28",7,"S",3,28,"9","0"]
[{"$f":"1*(CONCATENATE(TEXT(H336,0),TEXT(I336,\"00\")))","v":329},"2019-03-29",{"$f":"WEEKDAY(B336)","v":6},{"$f":"VLOOKUP(C336,$M$3:$N$9,2,FALSE)","v":"F"},"2020-03-29",1,"S",3,29,"9","0"]
[{"$f":"1*(CONCATENATE(TEXT(H337,0),TEXT(I337,\"00\")))","v":330},"2019-03-30",{"$f":"WEEKDAY(B337)","v":7},{"$f":"VLOOKUP(C337,$M$3:$N$9,2,FALSE)","v":"S"},"2020-03-30",2,"M",3,30,"9","0"]
[{"$f":"1*(CONCATENATE(TEXT(H338,0),TEXT(I338,\"00\")))","v":331},"2019-03-31",{"$f":"WEEKDAY(B338)","v":1},{"$f":"VLOOKUP(C338,$M$3:$N$9,2,FALSE)","v":"S"},"2020-03-31",3,"T",3,31,"9","0"]
[{"$f":"1*(CONCATENATE(TEXT(H339,0),TEXT(I339,\"00\")))","v":401},"2019-04-01",{"$f":"WEEKDAY(B339)","v":2},{"$f":"VLOOKUP(C339,$M$3:$N$9,2,FALSE)","v":"M"},"2020-04-01",4,"W",4,1,"9","0"]
[{"$f":"1*(CONCATENATE(TEXT(H340,0),TEXT(I340,\"00\")))","v":402},"2019-04-02",{"$f":"WEEKDAY(B340)","v":3},{"$f":"VLOOKUP(C340,$M$3:$N$9,2,FALSE)","v":"T"},"2020-04-02",5,"R",4,2,"9","0"]
[{"$f":"1*(CONCATENATE(TEXT(H341,0),TEXT(I341,\"00\")))","v":403},"2019-04-03",{"$f":"WEEKDAY(B341)","v":4},{"$f":"VLOOKUP(C341,$M$3:$N$9,2,FALSE)","v":"W"},"2020-04-03",6,"F",4,3,"9","0"]
[{"$f":"1*(CONCATENATE(TEXT(H342,0),TEXT(I342,\"00\")))","v":404},"2019-04-04",{"$f":"WEEKDAY(B342)","v":5},{"$f":"VLOOKUP(C342,$M$3:$N$9,2,FALSE)","v":"R"},"2020-04-04",7,"S",4,4,"9","0"]
[{"$f":"1*(CONCATENATE(TEXT(H343,0),TEXT(I343,\"00\")))","v":405},"2019-04-05",{"$f":"WEEKDAY(B343)","v":6},{"$f":"VLOOKUP(C343,$M$3:$N$9,2,FALSE)","v":"F"},"2020-04-05",1,"S",4,5,"9","0"]
[{"$f":"1*(CONCATENATE(TEXT(H344,0),TEXT(I344,\"00\")))","v":406},"2019-04-06",{"$f":"WEEKDAY(B344)","v":7},{"$f":"VLOOKUP(C344,$M$3:$N$9,2,FALSE)","v":"S"},"2020-04-06",2,"M",4,6,"9","0"]
[{"$f":"1*(CONCATENATE(TEXT(H345,0),TEXT(I345,\"00\")))","v":407},"2019-04-07",{"$f":"WEEKDAY(B345)","v":1},{"$f":"VLOOKUP(C345,$M$3:$N$9,2,FALSE)","v":"S"},"2020-04-07",3,"T",4,7,"9","0"]
[{"$f":"1*(CONCATENATE(TEXT(H346,0),TEXT(I346,\"00\")))","v":408},"2019-04-08",{"$f":"WEEKDAY(B346)","v":2},{"$f":"VLOOKUP(C346,$M$3:$N$9,2,FALSE)","v":"M"},"2020-04-08",4,"W",4,8,"9","0"]
[{"$f":"1*(CONCATENATE(TEXT(H347,0),TEXT(I347,\"00\")))","v":409},"2019-04-09",{"$f":"WEEKDAY(B347)","v":3},{"$f":"VLOOKUP(C347,$M$3:$N$9,2,FALSE)","v":"T"},"2020-04-09",5,"R",4,9,"9","0"]
[{"$f":"1*(CONCATENATE(TEXT(H348,0),TEXT(I348,\"00\")))","v":410},"2019-04-10",{"$f":"WEEKDAY(B348)","v":4},{"$f":"VLOOKUP(C348,$M$3:$N$9,2,FALSE)","v":"W"},"2020-04-10",6,"F",4,10,"9","0"]
[{"$f":"1*(CONCATENATE(TEXT(H349,0),TEXT(I349,\"00\")))","v":411},"2019-04-11",{"$f":"WEEKDAY(B349)","v":5},{"$f":"VLOOKUP(C349,$M$3:$N$9,2,FALSE)","v":"R"},"2020-04-11",7,"S",4,11,"9","0"]
[{"$f":"1*(CONCATENATE(TEXT(H350,0),TEXT(I350,\"00\")))","v":412},"2019-04-12",{"$f":"WEEKDAY(B350)","v":6},{"$f":"VLOOKUP(C350,$M$3:$N$9,2,FALSE)","v":"F"},"2020-04-12",1,"S",4,12,"9","0"]
[{"$f":"1*(CONCATENATE(TEXT(H351,0),TEXT(I351,\"00\")))","v":413},"2019-04-13",{"$f":"WEEKDAY(B351)","v":7},{"$f":"VLOOKUP(C351,$M$3:$N$9,2,FALSE)","v":"S"},"2020-04-13",2,"M",{"$f":"MONTH(B351)","v":4},13,"9","0"]
[{"$f":"1*(CONCATENATE(TEXT(H352,0),TEXT(I352,\"00\")))","v":414},"2019-04-14",{"$f":"WEEKDAY(B352)","v":1},{"$f":"VLOOKUP(C352,$M$3:$N$9,2,FALSE)","v":"S"},"2020-04-14",{"$f":"WEEKDAY(E352)","v":3},{"$f":"VLOOKUP(F352,$M$3:$N$9,2,FALSE)","v":"T"},4,{"$f":"DAY(B352)","v":14},"9","0"]
[{"$f":"1*(CONCATENATE(TEXT(H353,0),TEXT(I353,\"00\")))","v":415},"2019-04-15",{"$f":"WEEKDAY(B353)","v":2},{"$f":"VLOOKUP(C353,$M$3:$N$9,2,FALSE)","v":"M"},"2020-04-15",4,"W",4,15,"9","0"]
[{"$f":"1*(CONCATENATE(TEXT(H354,0),TEXT(I354,\"00\")))","v":416},"2019-04-16",{"$f":"WEEKDAY(B354)","v":3},{"$f":"VLOOKUP(C354,$M$3:$N$9,2,FALSE)","v":"T"},"2020-04-16",5,"R",4,16,"9","0"]
[{"$f":"1*(CONCATENATE(TEXT(H355,0),TEXT(I355,\"00\")))","v":417},"2019-04-17",{"$f":"WEEKDAY(B355)","v":4},{"$f":"VLOOKUP(C355,$M$3:$N$9,2,FALSE)","v":"W"},"2020-04-17",6,"F",4,17,"9","0"]
[{"$f":"1*(CONCATENATE(TEXT(H356,0),TEXT(I356,\"00\")))","v":418},"2019-04-18",{"$f":"WEEKDAY(B356)","v":5},{"$f":"VLOOKUP(C356,$M$3:$N$9,2,FALSE)","v":"R"},"2020-04-18",7,"S",4,18,"9","0"]
[{"$f":"1*(CONCATENATE(TEXT(H357,0),TEXT(I357,\"00\")))","v":419},"2019-04-19",{"$f":"WEEKDAY(B357)","v":6},{"$f":"VLOOKUP(C357,$M$3:$N$9,2,FALSE)","v":"F"},"2020-04-19",1,"S",4,19,"9","0"]
[{"$f":"1*(CONCATENATE(TEXT(H358,0),TEXT(I358,\"00\")))","v":420},"2019-04-20",{"$f":"WEEKDAY(B358)","v":7},{"$f":"VLOOKUP(C358,$M$3:$N$9,2,FALSE)","v":"S"},"2020-04-20",2,"M",4,20,"9","0"]
[{"$f":"1*(CONCATENATE(TEXT(H359,0),TEXT(I359,\"00\")))","v":421},"2019-04-21",{"$f":"WEEKDAY(B359)","v":1},{"$f":"VLOOKUP(C359,$M$3:$N$9,2,FALSE)","v":"S"},"2020-04-21",3,"T",4,21,"9","0"]
[{"$f":"1*(CONCATENATE(TEXT(H360,0),TEXT(I360,\"00\")))","v":422},"2019-04-22",{"$f":"WEEKDAY(B360)","v":2},{"$f":"VLOOKUP(C360,$M$3:$N$9,2,FALSE)","v":"M"},"2020-04-22",4,"W",4,22,"9","0"]
[{"$f":"1*(CONCATENATE(TEXT(H361,0),TEXT(I361,\"00\")))","v":423},"2019-04-23",{"$f":"WEEKDAY(B361)","v":3},{"$f":"VLOOKUP(C361,$M$3:$N$9,2,FALSE)","v":"T"},"2020-04-23",5,"R",4,23,"9","0"]
[{"$f":"1*(CONCATENATE(TEXT(H362,0),TEXT(I362,\"00\")))","v":424},"2019-04-24",{"$f":"WEEKDAY(B362)","v":4},{"$f":"VLOOKUP(C362,$M$3:$N$9,2,FALSE)","v":"W"},"2020-04-24",6,"F",4,24,"9","0"]
[{"$f":"1*(CONCATENATE(TEXT(H363,0),TEXT(I363,\"00\")))","v":425},"2019-04-25",{"$f":"WEEKDAY(B363)","v":5},{"$f":"VLOOKUP(C363,$M$3:$N$9,2,FALSE)","v":"R"},"2020-04-25",7,"S",4,25,"9","0"]
[{"$f":"1*(CONCATENATE(TEXT(H364,0),TEXT(I364,\"00\")))","v":426},"2019-04-26",{"$f":"WEEKDAY(B364)","v":6},{"$f":"VLOOKUP(C364,$M$3:$N$9,2,FALSE)","v":"F"},"2020-04-26",1,"S",4,26,"9","0"]
[{"$f":"1*(CONCATENATE(TEXT(H365,0),TEXT(I365,\"00\")))","v":427},"2019-04-27",{"$f":"WEEKDAY(B365)","v":7},{"$f":"VLOOKUP(C365,$M$3:$N$9,2,FALSE)","v":"S"},"2020-04-27",2,"M",4,27,"9","0"]
[{"$f":"1*(CONCATENATE(TEXT(H366,0),TEXT(I366,\"00\")))","v":428},"2019-04-28",{"$f":"WEEKDAY(B366)","v":1},{"$f":"VLOOKUP(C366,$M$3:$N$9,2,FALSE)","v":"S"},"2020-04-28",3,"T",4,28,"9","0"]
[{"$f":"1*(CONCATENATE(TEXT(H367,0),TEXT(I367,\"00\")))","v":429},"2019-04-29",{"$f":"WEEKDAY(B367)","v":2},{"$f":"VLOOKUP(C367,$M$3:$N$9,2,FALSE)","v":"M"},"2020-04-29",4,"W",4,29,"9","0"]
[{"$f":"1*(CONCATENATE(TEXT(H368,0),TEXT(I368,\"00\")))","v":430},"2019-04-30",{"$f":"WEEKDAY(B368)","v":3},{"$f":"VLOOKUP(C368,$M$3:$N$9,2,FALSE)","v":"T"},"2020-04-30",5,"R",4,30,"9","0"]
[{"$f":"1*(CONCATENATE(TEXT(H369,0),TEXT(I369,\"00\")))","v":501},"2019-05-01",{"$f":"WEEKDAY(B369)","v":4},{"$f":"VLOOKUP(C369,$M$3:$N$9,2,FALSE)","v":"W"},"2020-05-01",6,"F",5,1,"9","0"]
[{"$f":"1*(CONCATENATE(TEXT(H370,0),TEXT(I370,\"00\")))","v":502},"2019-05-02",{"$f":"WEEKDAY(B370)","v":5},{"$f":"VLOOKUP(C370,$M$3:$N$9,2,FALSE)","v":"R"},"2020-05-02",7,"S",5,2,"9","0"]
[{"$f":"1*(CONCATENATE(TEXT(H371,0),TEXT(I371,\"00\")))","v":503},"2019-05-03",{"$f":"WEEKDAY(B371)","v":6},{"$f":"VLOOKUP(C371,$M$3:$N$9,2,FALSE)","v":"F"},"2020-05-03",1,"S",5,3,"9","0"]
[{"$f":"1*(CONCATENATE(TEXT(H372,0),TEXT(I372,\"00\")))","v":504},"2019-05-04",{"$f":"WEEKDAY(B372)","v":7},{"$f":"VLOOKUP(C372,$M$3:$N$9,2,FALSE)","v":"S"},"2020-05-04",2,"M",5,4,"9","0"]
[{"$f":"1*(CONCATENATE(TEXT(H373,0),TEXT(I373,\"00\")))","v":505},"2019-05-05",{"$f":"WEEKDAY(B373)","v":1},{"$f":"VLOOKUP(C373,$M$3:$N$9,2,FALSE)","v":"S"},"2020-05-05",3,"T",5,5,"9","0"]
[{"$f":"1*(CONCATENATE(TEXT(H374,0),TEXT(I374,\"00\")))","v":506},"2019-05-06",{"$f":"WEEKDAY(B374)","v":2},{"$f":"VLOOKUP(C374,$M$3:$N$9,2,FALSE)","v":"M"},"2020-05-06",4,"W",5,6,"9","0"]
[{"$f":"1*(CONCATENATE(TEXT(H375,0),TEXT(I375,\"00\")))","v":507},"2019-05-07",{"$f":"WEEKDAY(B375)","v":3},{"$f":"VLOOKUP(C375,$M$3:$N$9,2,FALSE)","v":"T"},"2020-05-07",5,"R",5,7,"9","0"]
[{"$f":"1*(CONCATENATE(TEXT(H376,0),TEXT(I376,\"00\")))","v":508},"2019-05-08",{"$f":"WEEKDAY(B376)","v":4},{"$f":"VLOOKUP(C376,$M$3:$N$9,2,FALSE)","v":"W"},"2020-05-08",6,"F",5,8,"9","0"]
[{"$f":"1*(CONCATENATE(TEXT(H377,0),TEXT(I377,\"00\")))","v":509},"2019-05-09",{"$f":"WEEKDAY(B377)","v":5},{"$f":"VLOOKUP(C377,$M$3:$N$9,2,FALSE)","v":"R"},"2020-05-09",7,"S",5,9,"9","0"]
[{"$f":"1*(CONCATENATE(TEXT(H378,0),TEXT(I378,\"00\")))","v":510},"2019-05-10",{"$f":"WEEKDAY(B378)","v":6},{"$f":"VLOOKUP(C378,$M$3:$N$9,2,FALSE)","v":"F"},"2020-05-10",1,"S",5,10,"9","0"]
[{"$f":"1*(CONCATENATE(TEXT(H379,0),TEXT(I379,\"00\")))","v":511},"2019-05-11",{"$f":"WEEKDAY(B379)","v":7},{"$f":"VLOOKUP(C379,$M$3:$N$9,2,FALSE)","v":"S"},"2020-05-11",2,"M",5,11,"9","0"]
[{"$f":"1*(CONCATENATE(TEXT(H380,0),TEXT(I380,\"00\")))","v":512},"2019-05-12",{"$f":"WEEKDAY(B380)","v":1},{"$f":"VLOOKUP(C380,$M$3:$N$9,2,FALSE)","v":"S"},"2020-05-12",3,"T",5,12,"9","0"]
[{"$f":"1*(CONCATENATE(TEXT(H381,0),TEXT(I381,\"00\")))","v":513},"2019-05-13",{"$f":"WEEKDAY(B381)","v":2},{"$f":"VLOOKUP(C381,$M$3:$N$9,2,FALSE)","v":"M"},"2020-05-13",4,"W",5,13,"9","0"]
[{"$f":"1*(CONCATENATE(TEXT(H382,0),TEXT(I382,\"00\")))","v":514},"2019-05-14",{"$f":"WEEKDAY(B382)","v":3},{"$f":"VLOOKUP(C382,$M$3:$N$9,2,FALSE)","v":"T"},"2020-05-14",5,"R",5,14,"9","0"]
[{"$f":"1*(CONCATENATE(TEXT(H383,0),TEXT(I383,\"00\")))","v":515},"2019-05-15",{"$f":"WEEKDAY(B383)","v":4},{"$f":"VLOOKUP(C383,$M$3:$N$9,2,FALSE)","v":"W"},"2020-05-15",6,"F",5,15,"9","0"]
[{"$f":"1*(CONCATENATE(TEXT(H384,0),TEXT(I384,\"00\")))","v":516},"2019-05-16",{"$f":"WEEKDAY(B384)","v":5},{"$f":"VLOOKUP(C384,$M$3:$N$9,2,FALSE)","v":"R"},"2020-05-16",7,"S",5,16,"9","0"]
[{"$f":"1*(CONCATENATE(TEXT(H385,0),TEXT(I385,\"00\")))","v":517},"2019-05-17",{"$f":"WEEKDAY(B385)","v":6},{"$f":"VLOOKUP(C385,$M$3:$N$9,2,FALSE)","v":"F"},"2020-05-17",1,"S",5,17,"9","0"]
[{"$f":"1*(CONCATENATE(TEXT(H386,0),TEXT(I386,\"00\")))","v":518},"2019-05-18",{"$f":"WEEKDAY(B386)","v":7},{"$f":"VLOOKUP(C386,$M$3:$N$9,2,FALSE)","v":"S"},"2020-05-18",2,"M",5,18,"9","0"]
[{"$f":"1*(CONCATENATE(TEXT(H387,0),TEXT(I387,\"00\")))","v":519},"2019-05-19",{"$f":"WEEKDAY(B387)","v":1},{"$f":"VLOOKUP(C387,$M$3:$N$9,2,FALSE)","v":"S"},"2020-05-19",3,"T",5,19,"9","0"]
[{"$f":"1*(CONCATENATE(TEXT(H388,0),TEXT(I388,\"00\")))","v":520},"2019-05-20",{"$f":"WEEKDAY(B388)","v":2},{"$f":"VLOOKUP(C388,$M$3:$N$9,2,FALSE)","v":"M"},"2020-05-20",4,"W",5,20,{"$f":"RIGHT(YEAR(B388),1)","v":"9"},{"$f":"RIGHT(YEAR(E388),1)","v":"0"}]
[{"$f":"1*(CONCATENATE(TEXT(H389,0),TEXT(I389,\"00\")))","v":521},"2019-05-21",{"$f":"WEEKDAY(B389)","v":3},{"$f":"VLOOKUP(C389,$M$3:$N$9,2,FALSE)","v":"T"},"2020-05-21",5,"R",5,21,"9","0"]
[{"$f":"1*(CONCATENATE(TEXT(H390,0),TEXT(I390,\"00\")))","v":522},"2019-05-22",{"$f":"WEEKDAY(B390)","v":4},{"$f":"VLOOKUP(C390,$M$3:$N$9,2,FALSE)","v":"W"},"2020-05-22",6,"F",5,22,"9","0"]
[{"$f":"1*(CONCATENATE(TEXT(H391,0),TEXT(I391,\"00\")))","v":523},"2019-05-23",{"$f":"WEEKDAY(B391)","v":5},{"$f":"VLOOKUP(C391,$M$3:$N$9,2,FALSE)","v":"R"},"2020-05-23",7,"S",5,23,"9","0"]
[{"$f":"1*(CONCATENATE(TEXT(H392,0),TEXT(I392,\"00\")))","v":524},"2019-05-24",{"$f":"WEEKDAY(B392)","v":6},{"$f":"VLOOKUP(C392,$M$3:$N$9,2,FALSE)","v":"F"},"2020-05-24",1,"S",5,24,"9","0"]
[{"$f":"1*(CONCATENATE(TEXT(H393,0),TEXT(I393,\"00\")))","v":525},"2019-05-25",{"$f":"WEEKDAY(B393)","v":7},{"$f":"VLOOKUP(C393,$M$3:$N$9,2,FALSE)","v":"S"},"2020-05-25",2,"M",5,25,"9","0"]
[{"$f":"1*(CONCATENATE(TEXT(H394,0),TEXT(I394,\"00\")))","v":526},"2019-05-26",{"$f":"WEEKDAY(B394)","v":1},{"$f":"VLOOKUP(C394,$M$3:$N$9,2,FALSE)","v":"S"},"2020-05-26",3,"T",5,26,"9","0"]
[{"$f":"1*(CONCATENATE(TEXT(H395,0),TEXT(I395,\"00\")))","v":527},"2019-05-27",{"$f":"WEEKDAY(B395)","v":2},{"$f":"VLOOKUP(C395,$M$3:$N$9,2,FALSE)","v":"M"},"2020-05-27",4,"W",5,27,"9","0"]
[{"$f":"1*(CONCATENATE(TEXT(H396,0),TEXT(I396,\"00\")))","v":528},"2019-05-28",{"$f":"WEEKDAY(B396)","v":3},{"$f":"VLOOKUP(C396,$M$3:$N$9,2,FALSE)","v":"T"},"2020-05-28",5,"R",5,28,"9","0"]
[{"$f":"1*(CONCATENATE(TEXT(H397,0),TEXT(I397,\"00\")))","v":529},"2019-05-29",{"$f":"WEEKDAY(B397)","v":4},{"$f":"VLOOKUP(C397,$M$3:$N$9,2,FALSE)","v":"W"},"2020-05-29",6,"F",5,29,"9","0"]
[{"$f":"1*(CONCATENATE(TEXT(H398,0),TEXT(I398,\"00\")))","v":530},"2019-05-30",{"$f":"WEEKDAY(B398)","v":5},{"$f":"VLOOKUP(C398,$M$3:$N$9,2,FALSE)","v":"R"},"2020-05-30",7,"S",5,30,"9","0"]
[531,"2019-05-31",6,"F","2020-05-31",1,"S",5,31,"9","0"]
[601,"2019-06-01",7,"S","2020-06-01",2,"M",6,1,"9","0"]
[602,"2019-06-02",1,"S","2020-06-02",3,"T",6,2,"9","0"]
[603,"2019-06-03",2,"M","2020-06-03",4,"W",6,3,"9","0"]
[604,"2019-06-04",3,"T","2020-06-04",5,"R",6,4,"9","0"]
[605,"2019-06-05",4,"W","2020-06-05",6,"F",6,5,"9","0"]
[606,"2019-06-06",5,"R","2020-06-06",7,"S",6,6,"9","0"]
[607,"2019-06-07",6,"F","2020-06-07",1,"S",6,7,"9","0"]
[608,"2019-06-08",7,"S","2020-06-08",2,"M",6,8,"9","0"]
[609,"2019-06-09",1,"S","2020-06-09",3,"T",6,9,"9","0"]
[610,"2019-06-10",2,"M","2020-06-10",4,"W",6,10,"9","0"]
[611,"2019-06-11",3,"T","2020-06-11",5,"R",6,11,"9","0"]
[612,"2019-06-12",4,"W","2020-06-12",6,"F",6,12,"9","0"]
[613,"2019-06-13",5,"R","2020-06-13",7,"S",6,13,"9","0"]
[614,"2019-06-14",6,"F","2020-06-14",1,"S",6,14,"9","0"]
[615,"2019-06-15",7,"S","2020-06-15",2,"M",6,15,"9","0"]
[616,"2019-06-16",1,"S","2020-06-16",3,"T",{"$f":"MONTH(B415)","v":6},16,"9","0"]
[617,"2019-06-17",2,"M","2020-06-17",{"$f":"WEEKDAY(E416)","v":4},{"$f":"VLOOKUP(F416,$M$3:$N$9,2,FALSE)","v":"W"},6,{"$f":"DAY(B416)","v":17},"9","0"]
[618,"2019-06-18",3,"T","2020-06-18",5,"R",6,18,"9","0"]
[619,"2019-06-19",4,"W","2020-06-19",6,"F",6,19,"9","0"]
[620,"2019-06-20",5,"R","2020-06-20",7,"S",6,20,"9","0"]
[621,"2019-06-21",6,"F","2020-06-21",1,"S",6,21,"9","0"]
[622,"2019-06-22",7,"S","2020-06-22",2,"M",6,22,"9","0"]
[623,"2019-06-23",1,"S","2020-06-23",3,"T",6,23,"9","0"]
[624,"2019-06-24",2,"M","2020-06-24",4,"W",6,24,"9","0"]
[625,"2019-06-25",3,"T","2020-06-25",5,"R",6,25,"9","0"]
[626,"2019-06-26",4,"W","2020-06-26",6,"F",6,26,"9","0"]
[627,"2019-06-27",5,"R","2020-06-27",7,"S",6,27,"9","0"]
[628,"2019-06-28",6,"F","2020-06-28",1,"S",6,28,"9","0"]
[629,"2019-06-29",7,"S","2020-06-29",2,"M",6,29,"9","0"]
[630,"2019-06-30",1,"S","2020-06-30",3,"T",6,30,"9","0"]
[701,"2019-07-01",2,"M","2020-07-01",4,"W",7,1,"9","0"]
[702,"2019-07-02",3,"T","2020-07-02",5,"R",7,2,"9","0"]
[703,"2019-07-03",4,"W","2020-07-03",6,"F",7,3,"9","0"]
[704,"2019-07-04",5,"R","2020-07-04",7,"S",7,4,"9","0"]
[705,"2019-07-05",6,"F","2020-07-05",1,"S",7,5,"9","0"]
[706,"2019-07-06",7,"S","2020-07-06",2,"M",7,6,"9","0"]
[707,"2019-07-07",1,"S","2020-07-07",3,"T",7,7,"9","0"]
[708,"2019-07-08",2,"M","2020-07-08",4,"W",7,8,"9","0"]
[709,"2019-07-09",3,"T","2020-07-09",5,"R",7,9,"9","0"]
[710,"2019-07-10",4,"W","2020-07-10",6,"F",7,10,"9","0"]
[711,"2019-07-11",5,"R","2020-07-11",7,"S",7,11,"9","0"]
[712,"2019-07-12",6,"F","2020-07-12",1,"S",7,12,"9","0"]
[713,"2019-07-13",7,"S","2020-07-13",2,"M",7,13,"9","0"]
[714,"2019-07-14",1,"S","2020-07-14",3,"T",7,14,"9","0"]
[715,"2019-07-15",2,"M","2020-07-15",4,"W",7,15,"9","0"]
[716,"2019-07-16",3,"T","2020-07-16",5,"R",7,16,"9","0"]
[717,"2019-07-17",4,"W","2020-07-17",6,"F",7,17,"9","0"]
[718,"2019-07-18",5,"R","2020-07-18",7,"S",7,18,"9","0"]
[719,"2019-07-19",6,"F","2020-07-19",1,"S",7,19,"9","0"]
[720,"2019-07-20",7,"S","2020-07-20",2,"M",7,20,"9","0"]
[721,"2019-07-21",1,"S","2020-07-21",3,"T",7,21,"9","0"]
[722,"2019-07-22",2,"M","2020-07-22",4,"W",7,22,"9","0"]
[723,"2019-07-23",3,"T","2020-07-23",5,"R",7,23,{"$f":"RIGHT(YEAR(B452),1)","v":"9"},{"$f":"RIGHT(YEAR(E452),1)","v":"0"}]
[724,"2019-07-24",4,"W","2020-07-24",6,"F",7,24,"9","0"]
[725,"2019-07-25",5,"R","2020-07-25",7,"S",7,25,"9","0"]
[726,"2019-07-26",6,"F","2020-07-26",1,"S",7,26,"9","0"]
[727,"2019-07-27",7,"S","2020-07-27",2,"M",7,27,"9","0"]
[728,"2019-07-28",1,"S","2020-07-28",3,"T",7,28,"9","0"]
[729,"2019-07-29",2,"M","2020-07-29",4,"W",7,29,"9","0"]
[730,"2019-07-30",3,"T","2020-07-30",5,"R",7,30,"9","0"]
[731,"2019-07-31",4,"W","2020-07-31",{"$f":"WEEKDAY(E460)","v":6},"F",{"$f":"MONTH(B460)","v":7},{"$f":"DAY(B460)","v":31},"9","0"]
[0,"2019-08-01",5,"R"]